Year,TRI Facility ID,Facility Name,Street Address,City,County,ST,ZIP,Latitude,Longitude,Primary NAICS,NAICS 2,NAICS 3,NAICS 4,NAICS 5,NAICS 6,Parent Company Name,Parent Company DB Number,Doc_Ctrl_Num,Chemical,CAS #/Compound ID,Unit of Measure,Waste Management Code,Waste Management Description,Category of Waste Management,Sequence No.,Off-site Amount Sequence,Release NA,Dioxin Congener 1,Dioxin Congener 2,Dioxin Congener 3,Dioxin Congener 4,Dioxin Congener 5,Dioxin Congener 6,Dioxin Congener 7,Dioxin Congener 8,Dioxin Congener 9,Dioxin Congener 10,Dioxin Congener 11,Dioxin Congener 12,Dioxin Congener 13,Dioxin Congener 14,Dioxin Congener 15,Dioxin Congener 16,Dioxin Congener 17,Calculated TEQ,Total Transfer,Off Site Name,Off Site Address,Off Site City,Off Site County,Off Site State,Off Site Province,Off Site ZIP,Off Site Countru Abbr,Off Site Country,RCRA Num,Controlled Location,Data Extracted On
2010,00656DCRBNBOMAG,PREPA - SOUTH COAST POWER PLAN T,PR-127 KM157,GUAYANILLA,GUAYANILLA,PR,006560580,17.999722,-66.753889,221112,221122,221121,,,,PUERTO RICO ELECTRIC POWER AUTHORITY,090034703,1310208407561,DIOXIN AND DIOXIN-LIKE COMPOUNDS,N150,Grams,M73,Land Treatment,Release/Disposal,1,1,No,0,0,0,0,0,0,0,0,0,0,0,0,0,0,0,0,0,0,0,ALLIED WASTE OF PONCE,500 MUNICIPAL RD LA COTORR,PONCE,PONCE,PR,"",00731,USA,United States,PRD980594709,No,10/25/2011
2010,00751PRPGRPRO3K,PREPA - AGUIRRE POWER GENERATI ON COMPLEX,PR-03 KM 1527 BO MONTESORRIA AGUIRRE,AGUIRRE,SALINAS,PR,007040137,17.946075,-66.233802,221112,221122,221121,,,,PUERTO RICO ELECTRIC POWER AUTHORITY,090034703,1310208918767,DIOXIN AND DIOXIN-LIKE COMPOUNDS,N150,Grams,M73,Land Treatment,Release/Disposal,1,1,No,0,.0000675,.0001732,.0001802,.0002182,.0013055,.0056245,0,.0001754,.000135,.0002095,.000097,0,.0000651,.000449,0,0,.0002268,.0087,ALLIED WASTE OF PONCE INC.,500 MUNICIPAL RD. LA COTORRA,PONCE,PONCE,PR,"",00731,USA,United States,PRD980594709,No,10/25/2011
2010,00920PRPSNMERCA,PREPA - SAN JUAN STEAM PLANT,MERCADO CENTRAL AVE ZONA PORTUARIA RD PR-28,PUERTO NUEVO,SAN JUAN,PR,00920,18.42717,-66.104611,221112,221122,221121,,,,PUERTO RICO ELECTRIC POWER AUTHORITY,090034703,1310208919237,DIOXIN AND DIOXIN-LIKE COMPOUNDS,N150,Grams,M73,Land Treatment,Release/Disposal,1,1,No,0,.0024079,.0061556,.006408,.0077479,.04639,.19983,0,.0062333,.0047963,.0074372,.003437,0,.0023108,.015942,0,0,.0080667,.3091,LM WASTE SERVICE CORP.,"3199 AVE. SANTIAGO DE LOS CABALLEROS, EDIF. ADM P3, UNID. 55",PONCE,PONCE,PR,"",00716,USA,United States,NA,No,10/25/2011
2010,00950PRPPLPR165,PREPA - PALO SECO STEAM PLANT,PR-165 KM 318,TOA BAJA,TOA BAJA,PR,00949,18.455779,-66.1485,221112,221122,221121,,,,PUERTO RICO ELECTRIC POWER AUTHORITY,090034703,1310208918779,DIOXIN AND DIOXIN-LIKE COMPOUNDS,N150,Grams,M73,Land Treatment,Release/Disposal,1,1,No,0,.0000989,.0002528,.0002631,.0003186,.0019057,.0082106,0,.0002562,.0001969,.0003057,.0001414,0,.000095,.0006552,0,0,.0003314,.0127,LM WASTE SERVICE CORP.,3100 AVE. SANTIAGO DE LOS CABALLEROS EDIF. ADM P3 UNID. 5B,PONCE,PONCE,PR,"",00716,USA,United States,NA,No,10/25/2011
2010,03304PBLCS97RIV,MERRIMACK STATION,97 RIVER RD,BOW,MERRIMACK,NH,03304,43.13947,-71.47458,221112,,,,,,PUBLIC SERVICE CO OF NEW HAMPSHIRE,103801387,1310208573170,DIOXIN AND DIOXIN-LIKE COMPOUNDS,N150,Grams,M94,Transfer to Waste Broker-Disposal,Release/Disposal,1,1,No,0,0,0,0,0,0,0,0,0,0,0,0,0,0,0,0,0,0,0,UNITED OIL RECOVERY INC,410 SHATTUCK WAY,NEWINGTON,ROCKINGHAM,NH,"",03801,USA,United States,NHD980521843,No,10/25/2011
2010,03304PBLCS97RIV,MERRIMACK STATION,97 RIVER RD,BOW,MERRIMACK,NH,03304,43.13947,-71.47458,221112,,,,,,PUBLIC SERVICE CO OF NEW HAMPSHIRE,103801387,1310208573170,DIOXIN AND DIOXIN-LIKE COMPOUNDS,N150,Grams,M64,Other Landfills,Release/Disposal,2,1,No,0,0,0,0,0,0,0,0,0,0,0,0,0,0,0,0,0,0,0,GREENWOOD STREET LANDFILL,30 NIPP NAPP TRAIL,WORCESTER,WORCESTER,MA,"",01607,USA,United States,NA,No,10/25/2011
2010,03801NWNGT165GO,PUBLIC SERVICE CO OF NEW HAMPSHIRE NEWINGTON STATION,165 GOSLING RD,NEWINGTON,ROCKINGHAM,NH,03801,43.105,-70.806944,221112,,,,,,PUBLIC SERVICE CO OF NEW HAMPSHIRE,781260336,1310208689923,DIOXIN AND DIOXIN-LIKE COMPOUNDS,N150,Grams,M64,Other Landfills,Release/Disposal,1,1,No,0,0,0,0,0,0,0,0,0,0,0,0,0,0,0,0,0,0,0,WASTE MANAGEMENT NH TURNKEY LA,90 ROCHESTER NECK ROAD,ROCHESTER,STRAFFORD,NH,"",03867,USA,United States,NHD980914634,No,10/25/2011
2010,03801PBLCSGOSLI,SCHILLER STATION,400 GOSLING RD,PORTSMOUTH,ROCKINGHAM,NH,03801,43.097866,-70.783666,221112,,,,,,PUBLIC SERVICE CO OF NEW HAMPSHIRE,781260336,1310208715589,DIOXIN AND DIOXIN-LIKE COMPOUNDS,N150,Grams,M64,Other Landfills,Release/Disposal,1,1,No,0,0,0,0,0,0,0,0,0,0,0,0,0,0,0,0,0,0,0,GREENWOOD STREET LANDFILL,30 NIPP NAPP TRAIL,WORCESTER,WORCESTER,MA,"",01607,USA,United States,NA,No,10/25/2011
2010,03801PBLCSGOSLI,SCHILLER STATION,400 GOSLING RD,PORTSMOUTH,ROCKINGHAM,NH,03801,43.097866,-70.783666,221112,,,,,,PUBLIC SERVICE CO OF NEW HAMPSHIRE,781260336,1310208715589,DIOXIN AND DIOXIN-LIKE COMPOUNDS,N150,Grams,M79,Other Land Disposal,Release/Disposal,2,1,No,0,0,0,0,0,0,0,0,0,0,0,0,0,0,0,0,0,0,0,"SOIL PREPARATION, INC.",135 VALLEY ROAD,PLYMOUTH,PENOBSCOT,ME,"",04969,USA,United States,NA,No,10/25/2011
2010,03801PBLCSGOSLI,SCHILLER STATION,400 GOSLING RD,PORTSMOUTH,ROCKINGHAM,NH,03801,43.097866,-70.783666,221112,,,,,,PUBLIC SERVICE CO OF NEW HAMPSHIRE,781260336,1310208715589,DIOXIN AND DIOXIN-LIKE COMPOUNDS,N150,Grams,M64,Other Landfills,Release/Disposal,3,1,No,0,0,0,0,0,0,0,0,0,0,0,0,0,0,0,0,0,0,0,TURNKEY LANDFILL,97 ROCHESTER ROAD,GONIC,STRAFFORD,NH,"",03839,USA,United States,NHD980914634,No,10/25/2011
2010,04276BSCSCROUTE,RUMFORD PAPER CO,35 HARTFORD ST,RUMFORD,OXFORD,ME,04276,44.550556,-70.536389,322121,322110,,,,,NEWPAGE CORP,197533446,1310208226668,DIOXIN AND DIOXIN-LIKE COMPOUNDS,N150,Grams,M64,Other Landfills,Release/Disposal,1,1,No,0,0,0,0,0,.0098,.0805,.0649,.0053,.005,0,0,.0033,0,.0057,.0006,.0033,.0086651,.1784,FARRINGTON MOUNTAIN LANDFILL,RT 2,MEXICO,OXFORD,ME,"",04257,USA,United States,NA,Yes,10/25/2011
2010,04430GRTNRMAINS,KATAHDIN PAPER CO LLC,50 MAIN ST,EAST MILLINOCKET,PENOBSCOT,ME,04430,45.619722,-68.570278,322121,,,,,,KATAHDIN PAPER CO LLC,NA,1310208266849,DIOXIN AND DIOXIN-LIKE COMPOUNDS,N150,Grams,M90,Other Off-Site Management,Release/Disposal,1,1,No,.000169,.000236,0,0,0,.000736,.003518,.008995,.001808,.001355,.000444,.000067,0,0,0,0,.000131,.0018248,.0175,WILLIGAR HOME FARM,649 SOUTH PATTEN ROAD,PATTEN,PENOBSCOT,ME,"",04765,USA,United States,NA,No,10/25/2011
2010,04430GRTNRMAINS,KATAHDIN PAPER CO LLC,50 MAIN ST,EAST MILLINOCKET,PENOBSCOT,ME,04430,45.619722,-68.570278,322121,,,,,,KATAHDIN PAPER CO LLC,NA,1310208266849,DIOXIN AND DIOXIN-LIKE COMPOUNDS,N150,Grams,M90,Other Off-Site Management,Release/Disposal,2,1,No,.000022,.000031,0,0,0,.000095,.000455,.001165,.000234,.000175,.000057,.000009,0,0,0,0,.000017,.0002367,.00226,YORK FARM,523 PATTAGUMPUS ROAD,MEDWAY,PENOBSCOT,ME,"",04460,USA,United States,NA,No,10/25/2011
2010,04430GRTNRMAINS,KATAHDIN PAPER CO LLC,50 MAIN ST,EAST MILLINOCKET,PENOBSCOT,ME,04430,45.619722,-68.570278,322121,,,,,,KATAHDIN PAPER CO LLC,NA,1310208266849,DIOXIN AND DIOXIN-LIKE COMPOUNDS,N150,Grams,M90,Other Off-Site Management,Release/Disposal,3,1,No,.001079,.00151,0,0,0,.004707,.022485,.057498,.011557,.00866,.002835,.000431,0,0,0,0,.000836,.0116642,.112,LEE-SPRINGFIELD FARMS LLC,2958 LEE ROAD,LEE,PENOBSCOT,ME,"",04455,USA,United States,NA,No,10/25/2011
2010,04430GRTNRMAINS,KATAHDIN PAPER CO LLC,50 MAIN ST,EAST MILLINOCKET,PENOBSCOT,ME,04430,45.619722,-68.570278,322121,,,,,,KATAHDIN PAPER CO LLC,NA,1310208266849,DIOXIN AND DIOXIN-LIKE COMPOUNDS,N150,Grams,M64,Other Landfills,Release/Disposal,4,1,No,.000088,.000124,0,0,0,.000385,.001841,.004708,.000946,.000709,.000232,.000035,0,0,0,0,.000068,.000955,.00914,AUGUSTA TISSUE LANDFILL,CHURCH HILL ROAD,AUGUSTA,KENNEBEC,ME,"",04330,USA,United States,NA,No,10/25/2011
2010,04430GRTNRMAINS,KATAHDIN PAPER CO LLC,50 MAIN ST,EAST MILLINOCKET,PENOBSCOT,ME,04430,45.619722,-68.570278,322121,,,,,,KATAHDIN PAPER CO LLC,NA,1310208266849,DIOXIN AND DIOXIN-LIKE COMPOUNDS,N150,Grams,M90,Other Off-Site Management,Release/Disposal,5,1,No,.000039,.000055,0,0,0,.000172,.000821,.002098,.000422,.000316,.000103,.000016,0,0,0,0,.000031,.0004251,.00407,CUMMINGS FARM,NORTH HOWLAND ROAD,HOWLAND,PENOBSCOT,ME,"",04448,USA,United States,NA,No,10/25/2011
2010,04430GRTNRMAINS,KATAHDIN PAPER CO LLC,50 MAIN ST,EAST MILLINOCKET,PENOBSCOT,ME,04430,45.619722,-68.570278,322121,,,,,,KATAHDIN PAPER CO LLC,NA,1310208266849,DIOXIN AND DIOXIN-LIKE COMPOUNDS,N150,Grams,M64,Other Landfills,Release/Disposal,6,1,No,.000525,.000736,0,0,0,.002293,.010953,.028009,.005629,.004218,.001381,.00021,0,0,0,0,.000407,.0056816,.0544,DOLBY LANDFILL,ROUTE 157,EAST MILLINOCKET,PENOBSCOT,ME,"",04430,USA,United States,NA,Yes,10/25/2011
2010,04430GRTNRMAINS,KATAHDIN PAPER CO LLC,50 MAIN ST,EAST MILLINOCKET,PENOBSCOT,ME,04430,45.619722,-68.570278,322121,,,,,,KATAHDIN PAPER CO LLC,NA,1310208266849,DIOXIN AND DIOXIN-LIKE COMPOUNDS,N150,Grams,M90,Other Off-Site Management,Release/Disposal,7,1,No,.000112,.000157,0,0,0,.000491,.002343,.005991,.001204,.000902,.000295,.000045,0,0,0,0,.000087,.0012145,.0116,GUPTIL HOME FARMS,606 HAPPY CORNER ROAD,PATTEN,PENOBSCOT,ME,"",04765,USA,United States,NA,No,10/25/2011
2010,04430GRTNRMAINS,KATAHDIN PAPER CO LLC,50 MAIN ST,EAST MILLINOCKET,PENOBSCOT,ME,04430,45.619722,-68.570278,322121,,,,,,KATAHDIN PAPER CO LLC,NA,1310208266849,DIOXIN AND DIOXIN-LIKE COMPOUNDS,N150,Grams,M90,Other Off-Site Management,Release/Disposal,8,1,No,.000013,.000019,0,0,0,.000058,.000277,.000707,.000142,.000106,.000035,.000005,0,0,0,0,.00001,.0001434,.00137,STANLEY FARM,TURNPIKE ROAD,MEDWAY,PENOBSCOT,ME,"",04460,USA,United States,NA,No,10/25/2011
2010,04457LNCLNKATAH,LINCOLN PAPER & TISSUE LLC,50 KATAHDIN AVE,LINCOLN,PENOBSCOT,ME,04457,45.37,-68.509167,322110,322121,,,,,NA,NA,1310208748867,DIOXIN AND DIOXIN-LIKE COMPOUNDS,N150,Grams,M90,Other Off-Site Management,Release/Disposal,1,1,No,.0192,.0179,.0067,.0119,.0133,.0304,.0115,.1972,.0629,.0829,.0132,.0112,0,.0038,.005,0,0,.0899445,.4871,JUNIPER RIDGE LANDFILL,ROUTE 16 2828 BENNOCH ROAD,OLD TOWN,PENOBSCOT,ME,"",04468,USA,United States,NA,No,10/25/2011
2010,04468JMSRVPORTL,RED SHIELD ACQUISITION LLC,24 PORTLAND ST,OLD TOWN,PENOBSCOT,ME,044682024,44.917222,-68.636111,322110,,,,,,PATRIARCH PARTNERS LLC,NA,1310208328738,DIOXIN AND DIOXIN-LIKE COMPOUNDS,N150,Grams,M64,Other Landfills,Release/Disposal,1,1,No,.002,.001,.001,.002,.002,.051,.485,.026,.003,.002,.002,.001,.001,0,.005,0,.009,.0078982,.593,JUNIPER RIDGE LANDFILL,2828 BENNOCH ROAD,OLD TOWN,PENOBSCOT,ME,"",04468,USA,United States,NA,No,10/25/2011
2010,04740JMHBRPOBOX,HUBER ENGINEERED WOODS LLC,333 STATION RD,EASTON,AROOSTOOK,ME,04740,46.665557,-67.906918,321219,,,,,,JM HUBER CORP,002554459,1310208454759,DIOXIN AND DIOXIN-LIKE COMPOUNDS,N150,Grams,M64,Other Landfills,Release/Disposal,1,1,No,0,0,0,0,0,.0000001,.0000012,.0000002,0,0,0,0,0,0,0,0,.0000002,0,.0000016,PRESQUE ISLE LANDFILL,202 LATHROP ROAD,PRESQUE ISLE,AROOSTOOK,ME,"",04769,USA,United States,NA,No,10/25/2011
2010,06096THDXTTWOEL,AHLSTROM NONWOVENS LLC,CANAL BANK RD,WINDSOR LOCKS,HARTFORD,CT,06096,41.930031,-72.62676,322121,313230,,,,,AHLSTROM,540163599,1310208373175,DIOXIN AND DIOXIN-LIKE COMPOUNDS,N150,Grams,M73,Land Treatment,Release/Disposal,1,1,No,0,0,0,0,0,0,0,0,0,.0155,0,0,0,0,0,.0035,0,.004685,.019,COVER TECHNOLOGIES INC,95 STATE STREET,SPRINGFIELD,HAMPDEN,MA,"",01103,USA,United States,NA,No,10/25/2011
2010,07036XXN  1400P,CONOCOPHILLIPS CO - BAYWAY REFINERY,1400 PARK AVE,LINDEN,UNION,NJ,07036,40.640135,-74.21888,324110,,,,,,CONOCOPHILLIPS,118819478,1310208504098,DIOXIN AND DIOXIN-LIKE COMPOUNDS,N150,Grams,M64,Other Landfills,Release/Disposal,1,1,No,.003551,.003171,.003171,.003171,.003171,.187441,2.533883,.031452,.020799,.030437,.039568,.02232,.022828,.003171,.070512,.003171,.075078,.0327562,3.056895,VEOLIA ENVIRONMENTAL SERVICES,635 TOBY ROAD,KERSEY,ELK,PA,"",15846,USA,United States,PAD987398831,No,10/25/2011
2010,07036XXN  1400P,CONOCOPHILLIPS CO - BAYWAY REFINERY,1400 PARK AVE,LINDEN,UNION,NJ,07036,40.640135,-74.21888,324110,,,,,,CONOCOPHILLIPS,118819478,1310208504098,DIOXIN AND DIOXIN-LIKE COMPOUNDS,N150,Grams,M50,Incineration/Thermal Treatment,Treatment,2,1,No,.000752,.001627,.001505,.003681,.003213,.049012,.726034,.007545,.003762,.005877,.009192,.004759,.004047,.000254,.01267,.001302,.014419,.0085265,.849651,"CLEAN HARBORS EL DORADO, LLC",309 AMERICAN CIRCLE,EL DORADO,UNION,AR,"",71730,USA,United States,ARD069748192,No,10/25/2011
2010,07407MRCLP1MARK,MARCAL  MANUFACTURING LLC,1 MARKET ST,ELMWOOD PARK,BERGEN,NJ,074071451,40.902127,-74.130183,322291,,,,,,MARCAL MANUFACTURING LLC,827074753,1310208738308,DIOXIN AND DIOXIN-LIKE COMPOUNDS,N150,Grams,M90,Other Off-Site Management,Release/Disposal,2,1,No,0,.014,.014,.014,.014,.487,7.851,.034,.014,.014,.014,.014,.014,.014,.033,.014,.125,.0395528,8.68,THE SCOTTS COMPANY,311 REEDVILLE ROAD,OXFORD,CHESTER,PA,"",19363,USA,United States,NA,No,10/25/2011
2010,07407MRCLP1MARK,MARCAL  MANUFACTURING LLC,1 MARKET ST,ELMWOOD PARK,BERGEN,NJ,074071451,40.902127,-74.130183,322291,,,,,,MARCAL MANUFACTURING LLC,827074753,1310208738308,DIOXIN AND DIOXIN-LIKE COMPOUNDS,N150,Grams,M54,Incineration/Insignificant Fuel Value,Treatment,3,1,No,.001,.048,.048,.048,.048,1.611,25.94,.113,.048,.048,.048,.048,.048,.048,.109,.048,.413,.1353259,28.72,NORTHAMPTON GENERATING COMPANY,1 HORWITH DRIVE,NORTHAMPTON,NORTHAMPTON,PA,"",18067,USA,United States,NA,No,10/25/2011
2010,07407MRCLP1MARK,MARCAL  MANUFACTURING LLC,1 MARKET ST,ELMWOOD PARK,BERGEN,NJ,074071451,40.902127,-74.130183,322291,,,,,,MARCAL MANUFACTURING LLC,827074753,1310208738308,DIOXIN AND DIOXIN-LIKE COMPOUNDS,N150,Grams,M79,Other Land Disposal,Release/Disposal,4,1,No,0,.018,.018,.018,.018,.597,9.612,.042,.018,.018,.018,.018,.018,.018,.04,.018,.153,.0502195,10.64,SUMMIT ANTHRACITE,512 MAIN STREET,GOOD SPRING,SCHUYLKILL,PA,"",17981,USA,United States,NA,No,10/25/2011
2010,07407MRCLP1MARK,MARCAL  MANUFACTURING LLC,1 MARKET ST,ELMWOOD PARK,BERGEN,NJ,074071451,40.902127,-74.130183,322291,,,,,,MARCAL MANUFACTURING LLC,827074753,1310208738308,DIOXIN AND DIOXIN-LIKE COMPOUNDS,N150,Grams,M64,Other Landfills,Release/Disposal,5,1,No,0,.001,.001,.001,.001,.025,.402,.002,.001,.001,.001,.001,.001,.01,.002,.001,.006,.0035324,.46,NJMC,1 DEKORTE PARK PLAZA,LYNDHURST,BERGEN,NJ,"",07071,USA,United States,NA,No,10/25/2011
2010,08103STTMT941SO,STATE METAL INDUSTRIES INC,941 S SECOND ST,CAMDEN,CAMDEN,NJ,08103,39.933374,-75.12759,331314,,,,,,NA,NA,1310208586053,DIOXIN AND DIOXIN-LIKE COMPOUNDS,N150,Grams,M66,RCRA Subtitle C Surface Impoundment,Release/Disposal,1,1,No,.1641,.1541,.0522,.0895,.1318,.2735,.4226,13.6726,.9198,1.0689,1.2927,.522,.0323,.2983,.9944,.1467,.3977,2.2899961,20.6332,"WASTE MANAGEMENT OF PA GROWS, INC.",1513 BORDENTOWN ROAD,MORRISVILLE,BUCKS,PA,"",19067,USA,United States,PAD982704264,No,10/25/2011
2010,12188GNRLL260HU,MPM SILICONES LLC,260 HUDSON RIVER RD,WATERFORD,SARATOGA,NY,12188,42.816611,-73.668139,325211,325188,325212,,,,MOMENTIVE PERFORMANCE MATERIALS,NA,1310208633053,DIOXIN AND DIOXIN-LIKE COMPOUNDS,N150,Grams,M50,Incineration/Thermal Treatment,Treatment,1,1,No,.003251,.004412,.005689,.009075,.007276,.08011,.400552,.014861,.014435,.014726,.061921,.023607,.003386,.020898,.157512,.033283,.373462,.0301264,1.2,LAFARGE CEMENT,P.O. BOX 390,ST. CONSTANT,"",,QUEBEC,J5A2G,CAN,Canada,NA,No,10/25/2011
2010,12188GNRLL260HU,MPM SILICONES LLC,260 HUDSON RIVER RD,WATERFORD,SARATOGA,NY,12188,42.816611,-73.668139,325211,325188,325212,,,,MOMENTIVE PERFORMANCE MATERIALS,NA,1310208633053,DIOXIN AND DIOXIN-LIKE COMPOUNDS,N150,Grams,M50,Incineration/Thermal Treatment,Treatment,2,1,No,.004602,.006245,.008053,.012846,.010299,.113398,.566989,.021036,.020434,.020844,.08765,.033417,.004793,.029582,.222961,.047112,.528642,.0426442,1.7,ST. MARY'S CEMENT CO.,585 WATER STREET SOUTH,ST. MARY'S,"",,ONTARIO,N4X 1B6,CAN,Canada,NA,No,10/25/2011
2010,12188GNRLL260HU,MPM SILICONES LLC,260 HUDSON RIVER RD,WATERFORD,SARATOGA,NY,12188,42.816611,-73.668139,325211,325188,325212,,,,MOMENTIVE PERFORMANCE MATERIALS,NA,1310208633053,DIOXIN AND DIOXIN-LIKE COMPOUNDS,N150,Grams,M64,Other Landfills,Release/Disposal,3,1,No,.000008,.000011,.000015,.000024,.000019,.000208,.001041,.000039,.000038,.000038,.000161,.000061,.000009,.000054,.000409,.000087,.000971,.0000774,.0032,STABLEX CANADA,760 INDUSTRIAL BLVD.,BLAINVILLE,"",,QUEBEC,J7C 3,CAN,Canada,NA,No,10/25/2011
2010,12801FNCHP1GLEN,FINCH PAPER  LLC,1 GLEN ST,GLENS FALLS,WARREN,NY,12801,43.307194,-73.63925,322121,322110,,,,,FINCH PAPER HOLDINGS,NA,1310208406518,DIOXIN AND DIOXIN-LIKE COMPOUNDS,N150,Grams,M64,Other Landfills,Release/Disposal,1,1,No,.0069,0,0,0,0,.0734,.6583,.0585,0,0,0,0,0,0,0,0,0,.0136815,.7971,"SCOTT PAPER/FINCH PRUYN, PAPER SLUDGE MANAGEMENT FACILITY",PETERS RD,GANESVOORT,SARATOGA,NY,"",12831,USA,United States,NA,Yes,10/25/2011
2010,13126LCNRLLAKER,NOVELIS CORP,448 COUNTY RT 1A,OSWEGO,OSWEGO,NY,13126,43.490639,-76.455056,331315,331314,,,,,NOVELIS CORP,001504935,1310208739110,DIOXIN AND DIOXIN-LIKE COMPOUNDS,N150,Grams,M64,Other Landfills,Release/Disposal,1,1,No,0,0,0,0,0,0,0,0,0,0,0,0,0,0,0,0,0,0,.00779,BRISTOL HILL LANDFILL OSWEGO CO. DIV. OF SOLID WASTE,SILK ROAD,VOLNEY,OSWEGO,NY,"",13069,USA,United States,NYN00038514,No,10/25/2011
2010,13148SCPTR11LAM,SCEPTER INC,11 LAMB RD,SENECA FALLS,SENECA,NY,13148,43.01978,-76.82558,331314,,,,,,SCEPTER INC,NA,1310208415594,DIOXIN AND DIOXIN-LIKE COMPOUNDS,N150,Grams,M65,RCRA Subtitle C Landfills,Release/Disposal,1,1,No,.00372,.00966,.00599,.00899,.00544,.02054,.0142,.0833,.05817,.0963,.04729,.04407,.0151,.04774,.0675,.00894,.01821,.0707866,.555,AMERICAN ENVIRONMENTAL,1689 SHARCAL ROAD,CALVERT CITY,MARSHALL,KY,"",42029,USA,United States,KYD985073196,No,10/25/2011
2010,13148SCPTR11LAM,SCEPTER INC,11 LAMB RD,SENECA FALLS,SENECA,NY,13148,43.01978,-76.82558,331314,,,,,,SCEPTER INC,NA,1310208415594,DIOXIN AND DIOXIN-LIKE COMPOUNDS,N150,Grams,M64,Other Landfills,Release/Disposal,2,1,No,.00313,.00813,.00505,.00757,.00458,.01729,.01191,.07008,.04896,.08105,.0398,.03709,.01271,.04018,.05681,.00752,.01532,.0595742,.467,SENECA MEADOWS LANDFILL,1786 SALCMAN ROAD,WATERLOO,SENECA,NY,"",13165,USA,United States,NA,No,10/25/2011
2010,14107CWMCH1550B,CWM CHEMICAL SERVICES LLC,1550 BALMER RD,MODEL CITY,NIAGARA,NY,141070200,43.226667,-78.977778,562211,,,,,,WASTE MANAGEMENT INC,194672085,1310208291272,DIOXIN AND DIOXIN-LIKE COMPOUNDS,N150,Grams,M64,Other Landfills,Release/Disposal,1,1,No,.0003,.0013,.0012,.0043,.0014,.1096,1.1724,.0006,.0024,.0021,.0065,.0027,.002,.0022,.0243,.0042,.0392,.0061365,1.377,STABLEX CANADA INC,760 INDUSTRIAL BLVD,BLAINVILLE,"",,QUEBEC,J7C 3,CAN,Canada,NA,No,10/25/2011
2010,14302CCDNT4700B,OCCIDENTAL CHEMICAL CORP NIAGARA PLANT,4700 BUFFALO AVE,NIAGARA FALLS,NIAGARA,NY,14302,43.08275,-79.008583,325181,325199,,,,,OCCIDENTAL PETROLEUM CORP,006908354,1310208185571,DIOXIN AND DIOXIN-LIKE COMPOUNDS,N150,Grams,M50,Incineration/Thermal Treatment,Treatment,2,1,No,0,0,0,0,0,0,0,0,0,0,2.1,0,0,0,8.38,0,59.37,.311611,69.85,CLEAN HARBORS  (DEER PARK TX),2027 BATTLEGROUND ROAD,DEER PARK,HARRIS,TX,"",77536,USA,United States,TXD055141378,No,10/25/2011
2010,14302CCDNT4700B,OCCIDENTAL CHEMICAL CORP NIAGARA PLANT,4700 BUFFALO AVE,NIAGARA FALLS,NIAGARA,NY,14302,43.08275,-79.008583,325181,325199,,,,,OCCIDENTAL PETROLEUM CORP,006908354,1310208185571,DIOXIN AND DIOXIN-LIKE COMPOUNDS,N150,Grams,M64,Other Landfills,Release/Disposal,3,1,No,0,0,0,0,0,0,0,0,0,0,0,0,0,0,0,0,0,0,.3303,AILLED /NIAGARA RECYCLING,56TH & NIAGARA FALLS BLVD,NIAGARA FALLS,NIAGARA,NY,"",14304,USA,United States,NYD080340094,No,10/25/2011
2010,14302CCDNT4700B,OCCIDENTAL CHEMICAL CORP NIAGARA PLANT,4700 BUFFALO AVE,NIAGARA FALLS,NIAGARA,NY,14302,43.08275,-79.008583,325181,325199,,,,,OCCIDENTAL PETROLEUM CORP,006908354,1310208185571,DIOXIN AND DIOXIN-LIKE COMPOUNDS,N150,Grams,M50,Incineration/Thermal Treatment,Treatment,4,1,No,0,0,0,0,0,0,0,0,0,0,0,0,0,0,0,0,0,0,.7892,SIEMENS WATER TECHNOLOGY SERVICES,118 PARK ROAD,DARLINGTON,BEAVER,PA,"",16115,USA,United States,PAD987270725,No,10/25/2011
2010,14652STMNK1669L,EASTMAN KODAK CO EASTMAN BUSINESS PARK,1669 LAKE AVE,ROCHESTER,MONROE,NY,146523615,43.200083,-77.647389,325992,,,,,,EASTMAN KODAK CO,002206183,1310208362665,DIOXIN AND DIOXIN-LIKE COMPOUNDS,N150,Grams,M90,Other Off-Site Management,Release/Disposal,1,1,No,0,0,0,0,0,0,.1422681,0,0,0,0,0,0,0,0,0,0,.0000427,.1422681,XSTRATA COPPER CANADA,101 AVENUE PORTELANCE,ROUYN-NORANDA,"",,ONTARIO,J9X5B6,CAN,Canada,NA,No,10/25/2011
2010,14652STMNK1669L,EASTMAN KODAK CO EASTMAN BUSINESS PARK,1669 LAKE AVE,ROCHESTER,MONROE,NY,146523615,43.200083,-77.647389,325992,,,,,,EASTMAN KODAK CO,002206183,1310208362665,DIOXIN AND DIOXIN-LIKE COMPOUNDS,N150,Grams,M65,RCRA Subtitle C Landfills,Release/Disposal,2,1,No,0,0,0,.002345,0,.081089,1.174001,0,0,0,0,0,0,0,.010363,.001,.041149,.0015236,1.309947,CWM CHEMICAL SERVICES,1550 BALMER ROAD,MODEL CITY,NIAGARA,NY,"",14107,USA,United States,NYD049836679,No,10/25/2011
2010,15077FRSTNOFFRT,BRUCE MANSFIELD POWER PLANT,OFF RT 168 NEAR OHIO RIVER,SHIPPINGPORT,BEAVER,PA,150770038,40.635,-80.419722,221112,221113,221119,221122,221111,221121,FIRSTENERGY GENERATION CORP,800459724,1310208464154,DIOXIN AND DIOXIN-LIKE COMPOUNDS,N150,Grams,M67,Other Surface Impoundment,Release/Disposal,1,1,No,0,0,0,0,0,0,0,0,0,0,0,0,0,0,0,0,0,0,0,LITTLE BLUE RUN,3 MILES NW OF HOOKSTOWN,GEORGETOWN,BEAVER,PA,"",15043,USA,United States,NA,Yes,10/25/2011
2010,15845PNNTC100CE,DOMTAR - JOHNSONBURG MILL,100 CENTER ST,JOHNSONBURG,ELK,PA,15845,41.485062,-78.67697,322121,,,,,,DOMTAR CORP,789245110,1310208386096,DIOXIN AND DIOXIN-LIKE COMPOUNDS,N150,Grams,M73,Land Treatment,Release/Disposal,1,1,No,0,0,0,0,0,0,0,0,0,0,0,0,0,0,0,0,0,0,0,SQUABB HOLLOW,BRANDY CAMP,BRANDY CAMP,ELK,PA,"",15822,USA,United States,NA,Yes,10/25/2011
2010,15845PNNTC100CE,DOMTAR - JOHNSONBURG MILL,100 CENTER ST,JOHNSONBURG,ELK,PA,15845,41.485062,-78.67697,322121,,,,,,DOMTAR CORP,789245110,1310208386096,DIOXIN AND DIOXIN-LIKE COMPOUNDS,N150,Grams,M73,Land Treatment,Release/Disposal,2,1,No,0,0,0,0,0,0,0,0,0,0,0,0,0,0,0,0,0,0,0,BERNERD,DEP SITE,BENEZETTE,ELK,PA,"",15821,USA,United States,NA,Yes,10/25/2011
2010,15845PNNTC100CE,DOMTAR - JOHNSONBURG MILL,100 CENTER ST,JOHNSONBURG,ELK,PA,15845,41.485062,-78.67697,322121,,,,,,DOMTAR CORP,789245110,1310208386096,DIOXIN AND DIOXIN-LIKE COMPOUNDS,N150,Grams,M73,Land Treatment,Release/Disposal,3,1,No,0,0,0,0,0,0,0,0,0,0,0,0,0,0,0,0,0,0,0,STATE GAME LANDS 311,P&N SITE,BENEZETTE,ELK,PA,"",15821,USA,United States,NA,Yes,10/25/2011
2010,15845PNNTC100CE,DOMTAR - JOHNSONBURG MILL,100 CENTER ST,JOHNSONBURG,ELK,PA,15845,41.485062,-78.67697,322121,,,,,,DOMTAR CORP,789245110,1310208386096,DIOXIN AND DIOXIN-LIKE COMPOUNDS,N150,Grams,M73,Land Treatment,Release/Disposal,4,1,No,0,0,0,0,0,0,0,0,0,0,0,0,0,0,0,0,0,0,0,OYSTER RUN SITE,OYSTER RUN,BROCKPORT,JEFFERSON,PA,"",15823,USA,United States,NA,Yes,10/25/2011
2010,15845PNNTC100CE,DOMTAR - JOHNSONBURG MILL,100 CENTER ST,JOHNSONBURG,ELK,PA,15845,41.485062,-78.67697,322121,,,,,,DOMTAR CORP,789245110,1310208386096,DIOXIN AND DIOXIN-LIKE COMPOUNDS,N150,Grams,M73,Land Treatment,Release/Disposal,5,1,No,0,0,0,0,0,0,0,0,0,0,0,0,0,0,0,0,0,0,0,PHEASANTS FOREVER SITE,STATE GAME LANDS #44,BRANDY CAMP,ELK,PA,"",15822,USA,United States,NA,Yes,10/25/2011
2010,15927CLVRP141IN,COLVER POWER PROJECT,141 INTERPOWER DR,COLVER,CAMBRIA,PA,15927,40.550903,-78.81308,221119,,,,,,INTER-POWER/AHL/CON PARTNERS LP,110665130,1310208279416,DIOXIN AND DIOXIN-LIKE COMPOUNDS,N150,Grams,M73,Land Treatment,Release/Disposal,1,1,No,0,0,0,0,0,0,0,0,0,0,0,0,0,0,0,0,0,0,0,COLVER REFUSE SITE OPERATIONS,254 INTERPOWER DRIVE,COLVER,CAMBRIA,PA,"",15927,USA,United States,NA,Yes,10/25/2011