{"text_format":"1","workbook":"xlsx","n_sheets":15,"sheets":["Getting Started","Inputs","Results","SubThermalCalculator","SubGenSources","Biomass and Coal Data","Displaced Generation Profiles","Maps","Lists","STMTech","CHPTech","EGRID","Profiles","Factors","Calc1"],"not_rendered":{"charts":0,"images":12,"macros":1,"external_links":1,"defined_names":458,"comments":3,"pivot_tables":0},"unopened":[],"bounds":{"document_bytes":16777216,"sheet_cells":100000,"rows_first":2000,"rows_last":500,"rows_between":2000,"halvings":0,"cell_chars":16384,"cell_head_chars":4096},"cells_cut":0,"cells_raw":0,"read":"whole","date_system":"1900"}

{"sheet":"Getting Started","index":0,"n_rows":4,"n_cols":2,"rows_kept":4,"cut":false,"hidden":false,"merged":[[80,1,80,7],[82,1,82,7],[68,1,68,7],[79,1,79,7],[70,1,70,7],[72,1,72,7],[74,1,74,7],[76,1,76,7],[78,1,78,7],[106,1,106,6],[21,1,21,6],[23,1,23,6],[25,1,25,6],[27,1,27,6],[33,1,33,6],[102,1,102,6],[29,1,29,6],[35,1,35,6],[37,1,37,6],[39,1,39,6],[58,1,58,6],[60,1,60,7],[62,1,62,7],[64,1,64,7],[66,1,66,7],[17,1,17,6],[5,1,5,6],[7,1,7,6],[9,1,9,6],[11,1,11,6],[13,1,13,6]]}
[]
[]
[]
[null,"INTRODUCTION AND PURPOSE"]

{"sheet":"Inputs","index":1,"n_rows":218,"n_cols":5,"rows_kept":218,"cut":false,"hidden":false,"merged":[[157,0,157,2],[158,0,159,1],[17,2,20,2],[29,2,32,2],[136,1,136,2],[76,0,76,1],[152,3,156,3],[1,0,1,2],[144,0,144,1],[40,1,41,1],[91,0,92,0],[140,0,141,0],[116,0,117,0],[7,3,7,4]]}
[null,null," ",0]
["Energy Savings Inputs"]
["CHP System Characteristics"]
["1. CHP: Type of System",0]
[]
[null,1]
["2. CHP: Electricity Generating Capacity (per unit)"]
[null,{"$f":"IF(chptechinput>0,CONCATENATE(\"Normal size range for this technology is \",TEXT(caplow/chptechcaplow,\"#,###\"),\" to \",TEXT(caphigh/chptechcaphigh,\"#,###\"),\" kW\"),\" \")","v":" "}]
{"$rows_left_out":211}
{"sheet":"Results","index":2,"n_rows":173,"n_cols":7,"rows_kept":173,"cut":false,"hidden":false,"merged":[[142,3,142,4],[5,0,5,5],[6,0,6,4],[7,0,7,5],[14,0,14,3],[127,0,127,5],[89,0,89,5],[55,0,55,5],[90,0,90,5],[31,0,31,3],[32,0,32,3],[42,2,42,5],[13,0,13,3]]}
["CHP Results"]
[]
[]
[]
[]
["The results generated by the CHP Emissions Calculator are intended for educational and outreach purposes only; "]
["it is not designed for use in developing emission inventories or preparing air permit applications."]
["The results of this analysis have not been reviewed or endorsed by the EPA CHP Partnership."]
{"$rows_left_out":166}
{"sheet":"SubThermalCalculator","index":3,"n_rows":26,"n_cols":4,"rows_kept":26,"cut":false,"hidden":false,"merged":[[8,1,9,1],[13,1,14,1]]}
["Thermal Calculator"]
[]
[null,"Value","Units","Description"]
[]
[]
[null,"Calculate the Power to Heat Ratio by completing the "]
[null," entries in one of the following boxes:"]
[null,0,"MMBtu/hr","Thermal output from a single unit"]
{"$rows_left_out":19}
{"sheet":"SubGenSources","index":4,"n_rows":25,"n_cols":7,"rows_kept":25,"cut":false,"hidden":false,"merged":[]}
["Generation Sources"]
[]
[]
["Existing Generation Sources",null,null,null,null,"Heat Rate"]
["Name","Code","NOx lb/MWh","SO2 lb/MWh","CO2 lb/MWh","Btu/kWh"]
[{"$f":"LOOKUP(B6,Profiles!$B$11:$B$26,Profiles!$A$11:$A$26)","v":"EGrid Annual Average"},1,{"$f":"LOOKUP(B6,Profiles!B$11:B$26,Profiles!H$11:H$26)","v":0.94607755969518759},{"$f":"LOOKUP(B6,Profiles!B$11:B$26,Profiles!I$11:I$26)","v":1.8872353964120905},{"$f":"LOOKUP(B6,Profiles!B$11:B$26,Profiles!J$11:J$26)","v":1136.5291326364011},{"$f":"LOOKUP(B6,Profiles!B$11:B$26,Profiles!C$11:C$26)","v":6629.5773155103261},"EPA eGRID 2012 (released Oct. 2015), http://www.epa.gov/energy/egrid"]
[{"$f":"LOOKUP(B7,Profiles!$B$11:$B$26,Profiles!$A$11:$A$26)","v":"EGrid Annual Fossil"},2,{"$f":"LOOKUP(B7,Profiles!B$11:B$26,Profiles!H$11:H$26)","v":1.3268},{"$f":"LOOKUP(B7,Profiles!B$11:B$26,Profiles!I$11:I$26)","v":2.5741000000000001},{"$f":"LOOKUP(B7,Profiles!B$11:B$26,Profiles!J$11:J$26)","v":1640.1344999999999},{"$f":"LOOKUP(B7,Profiles!B$11:B$26,Profiles!C$11:C$26)","v":9447.7084265316407},"EPA eGRID 2012 (released Oct. 2015), http://www.epa.gov/energy/egrid"]
[{"$f":"LOOKUP(B8,Profiles!$B$11:$B$26,Profiles!$A$11:$A$26)","v":"EGrid Annual Coal"},4,{"$f":"LOOKUP(B8,Profiles!B$11:B$26,Profiles!H$11:H$26)","v":2.0270000000000001},{"$f":"LOOKUP(B8,Profiles!B$11:B$26,Profiles!I$11:I$26)","v":4.4062999999999999},{"$f":"LOOKUP(B8,Profiles!B$11:B$26,Profiles!J$11:J$26)","v":2173.9845285900478},{"$f":"LOOKUP(B8,Profiles!B$11:B$26,Profiles!C$11:C$26)","v":10486.160808514376},"EPA eGRID 2012 (released Oct. 2015), http://www.epa.gov/energy/egrid"]
{"$rows_left_out":18}
{"sheet":"Biomass and Coal Data","index":5,"n_rows":37,"n_cols":9,"rows_kept":37,"cut":false,"hidden":false,"merged":[[10,7,11,8],[24,1,25,2],[24,3,25,4],[2,1,2,6],[10,3,11,4],[10,1,11,2],[10,5,11,6]]}
["Biomass  "]
["Heat Content of Solid Biomass Fuels (Btu/lb delivered)"]
[null,"Moisture Content of Biomass"]
["Biomass Fuel Source","Bone Dry",0.1,0.2,0.3,0.4,0.5]
["Wood and Wood Residuals",7690,7004,6318,5632,4946,4260]
["Agricultural Byproducts",4125,3851,3577,3303,3029,2755]
["Peat",4000,3726,3452,3178,2904,2630]
["Solid Byproducts",12915,12095,11275,10455,9635,8815]
{"$rows_left_out":30}
{"sheet":"Displaced Generation Profiles","index":6,"n_rows":127,"n_cols":1,"rows_kept":127,"cut":false,"hidden":false,"merged":[[1,0,1,11],[126,0,127,10]]}
[]
["Selecting an Appropriate Displaced Electricity Generation Profile"]
[]
[]
[]
[]
[]
[]
{"$rows_left_out":120}
{"sheet":"Maps","index":7,"n_rows":0,"n_cols":0,"rows_kept":0,"cut":false,"hidden":false,"merged":[]}

{"sheet":"Lists","index":8,"n_rows":219,"n_cols":7,"rows_kept":219,"cut":false,"hidden":true,"merged":[]}
["CHP Pick list lookups"]
[]
["A1","CHP technology"]
[1,"Recip Engine - Rich Burn","Recip Engine - Rich Burn"]
[2,"Recip Engine - Lean Burn","Recip Engine - Lean Burn"]
[3,"Recip Engine - Diesel","Recip Engine - Diesel"]
[4,"Microturbine","Microturbine"]
[5,"Combustion Turbine","Combustion Turbine"]
{"$rows_left_out":212}
{"sheet":"STMTech","index":9,"n_rows":32,"n_cols":11,"rows_kept":32,"cut":false,"hidden":true,"merged":[]}
["Displaced Thermal Calculation"]
[]
["Selected Thermal Source"]
[{"$f":"stminput1","v":0},{"$f":"LOOKUP($A4,$A7:$A23,B7:B23)","v":{"$error":"#N/A"}},{"$f":"LOOKUP($A4,$A7:$A23,C7:C23)","v":{"$error":"#N/A"}},{"$f":"LOOKUP($A4,$A7:$A23,D7:D23)","v":{"$error":"#N/A"}},{"$error":"#N/A"},{"$error":"#N/A"},{"$error":"#N/A"},null,{"$error":"#N/A"},{"$error":"#N/A"},{"$error":"#N/A"}]
[]
[null,"Fuel used in displaced boiler","Boiler Eff","NOx lb/MMBtu","Sulfur content","SO2 lb/MMBtu","CO2 lb/MMBtu",null,"Fuel MMBtu/ton","CH4 lb/MMBtu","N2O lb/MMBtu"]
[1,"Existing - Natural Gas",0.8,0.1,{"$f":"ngsulfur","v":7.0967437470559683E-7},{"$f":"E7*2*2000/I7","v":5.8513618677087924E-4},{"$f":"co2gas","v":116.9},null,{"$f":"2000*ngbtu/(ngdensity*1000000)","v":4.8513449740443608},2.2040000000000002E-3,2.2040000000000002E-4]
[2,"Existing - Distillate Oil",0.8,0.15,4.8700000000000002E-4,5.1086266390614227E-2,{"$f":"co2oil","v":163.1},null,{"$f":"Factors!$A$16*42*2000/(Factors!$A$17*1000000)","v":38.131578947368418},6.6120000000000007E-3,1.3224000000000001E-3]
{"$rows_left_out":25}
{"sheet":"CHPTech","index":10,"n_rows":231,"n_cols":12,"rows_kept":231,"cut":false,"hidden":true,"merged":[]}
["CHP Technologies"]
[]
[null,"Selected"]
[null,"Technology"]
[null,{"$f":"chptechinput","v":0},1,2,3,4,5,6,7,8,9]
[null,{"$f":"LOOKUP(B$5,C$5:W$5,C6:W6)","v":{"$error":"#N/A"}},{"$f":"B30","v":"Recip Rich Burn"},{"$f":"B54","v":"Recip Lean Burn"},{"$f":"B78","v":"Recip Diesel"},{"$f":"B102","v":"Microturbine"},{"$f":"B126","v":"Combustion Turbine"},{"$f":"B150","v":"Boiler / Steam Turbine"},{"$f":"B174","v":"Fuel Cell"},{"$f":"B198","v":"Other"},"Waste Heat to Power"]
["Capacity (kW)",{"$error":"#N/A"},{"$f":"B31","v":0},{"$f":"B55","v":0},{"$f":"B79","v":0},{"$f":"B103","v":0},{"$f":"B127","v":0},0,0,0,{"$f":"chpcapinput","v":0}]
["CapLow (kW)",{"$error":"#N/A"},{"$f":"B32","v":5},{"$f":"B56","v":500},{"$f":"B80","v":90},{"$f":"B104","v":30},{"$f":"B128","v":1000},100,5,0,50]
{"$rows_left_out":224}
{"sheet":"EGRID","index":11,"n_rows":94,"n_cols":124,"rows_kept":94,"cut":false,"hidden":true,"merged":[]}
["eGRID2012 Version 1.0 NERC Region File (Year 2012 Data) "]
[null,null,null,null,null,null,null,null,null,null,null,null,null,null,null,null,null,null,null,null,null,null,null,null,null,null,null,null,null,null,null,null,null,null,null,null,null,null,null,null,null,null,null,null,null,null,null,null,null,null,null,null,null,null,null,null,null,null,null,null,null,null,null,null,null,null,null,null,null,null,null,null,null,null,null,null,null,"Calc","Calc"]
[null,null,null,null,"NAMEPCAP","STHTIAN","STHTIOZ","STNGENAN","STNGENOZ","STNOXAN","STNOXOZ","STSO2AN","STCO2AN","STCH4AN","STN2OAN","STCO2EQA","STHGAN","STNOXRTA","STNOXRTO","STSO2RTA","STCO2RTA","STCH4RTA","STN2ORTA","STC2ERTA","STHGRTA","STNOXRA","STNOXRO","STSO2RA","STCO2RA","STHGRA","STNOXCRT","STNOXCRO","STSO2CRT","STCO2CRT","STCH4CRT","STN2OCRT","STHGCRT","STCNOXRT","STONOXRT","STGNOXRT","STFSNXRT","STCNXORT","STONXORT","STGNXORT","STFSNORT","STCSO2RT","STOSO2RT","STGSO2RT","STFSS2RT","STCCO2RT","STOCO2RT","STGCO2RT","STFSC2RT","STCHGRT","STFSHGRT","STCNOXR","STONOXR","STGNOXR","STFSNXR","STCNXOR","STONXOR","STGNXOR","STFSNOR","STCSO2R","STOSO2R","STGSO2R","STFSS2R","STCCO2R","STOCO2R","STGCO2R","STFSC2R","STCHGR","STFSHGR","STNBNOX","STNBNXO","STNBSO2","STNBCO2","STNBCH4","STNBN2O","SRNBC2ER","STNBHG","STGENACL","STGENAOL","STGENAGS","STGENANC","STGENAHY","STGENABM","STGENAWI","STGENASO","STGENAGT","STGENAOF","STGENAOP","STGENATN","STGENATR","STGENATH","STGENACY","STGENACN","STCLPR","STOLPR","STGSPR","STNCPR","STHYPR","STBMPR","STWIPR","STSOPR","STGTPR","STOFPR","STOPPR","STTNPR","STTRPR","STTHPR","STCYPR","STCNPR",null,"STAHR"]
["SEQST00\ntate sequence number","SEQST99\nState sequence number","PSTATABB\nState abbreviation","FIPST\nFIPS State code","State nameplate capacity (MW)","State annual heat input (MMBtu)","State ozone season heat input (MMBtu)","State annual net generation (MWh)","State ozone season net generation (MWh)","State annual NOx emissions (tons)","State ozone season NOx emissions (tons)","State annual SO2 emissions (tons)","State annual CO2 emissions (tons)","State annual CH4 emissions (lbs)","State annual N2O emissions (lbs)","State annual CO2 equivalent emissions (tons)","State annual Hg emissions (lbs)","State annual NOx total output emission rate (lb/MWh)","State ozone season NOx total output emission rate (lb/MWh)","State annual SO2 total output emission rate (lb/MWh)","State annual CO2 total output emission rate (lb/MWh)","State annual CH4 total output emission rate (lb/GWh)","State annual N2O total output emission rate (lb/GWh)","State annual CO2 equivalent total output emission rate (lb/MWh)","State annual Hg total output emission rate (lb/GWh)","State annual NOx input emission rate (lb/MMBtu)","State ozone season NOx input emission rate (lb/MMBtu)","State annual SO2 input emission rate (lb/MMBtu)","State annual CO2 input emission rate (lb/MMBtu)","State annual Hg input emission rate (lb/BBtu)","State annual NOx combustion output emission rate (lb/MWh)","State ozone season NOx combustion output emission rate (lb/MWh)","State annual SO2 combustion output emission rate (lb/MWh)","State annual CO2 combustion output emission rate (lb/MWh)","State annual CH4 combustion output emission rate (lb/GWh)","State annual N2O combustion output emission rate (lb/GWh)","State annual Hg combustion output emission rate (lb/GWh)","State annual NOx coal output emission rate (lb/MWh)","State annual NOx oil output emission rate (lb/MWh)","State annual NOx gas output emission rate (lb/MWh)","State annual NOx fossil fuel output emission rate (lb/MWh)","State ozone season NOx coal output emission rate (lb/MWh)","State ozone season NOx oil output emission rate (lb/MWh)","State ozone season NOx gas output emission rate (lb/MWh)","State ozone season NOx fossil fuel output emission rate (lb/MWh)","State annual SO2 coal output emission rate (lb/MWh)","State annual SO2 oil output emission rate (lb/MWh)","State annual SO2 gas output emission rate (lb/MWh)","State annual SO2 fossil fuel output emission rate (lb/MWh)","State annual CO2 coal output emission rate (lb/MWh)","State annual CO2 oil output emission rate (lb/MWh)","State annual CO2 gas output emission rate (lb/MWh)","State annual CO2 fossil fuel output emission rate (lb/MWh)","State annual Hg coal output emission rate (lb/GWh)","State annual Hg fossil fuel output emission rate (lb/GWh)","State annual NOx coal input emission rate (lb/MMBtu)","State annual NOx oil input emission rate (lb/MMBtu)","State annual NOx gas input emission rate (lb/MMBtu)","State annual NOx fossil fuel input emission rate (lb/MMBtu)","State ozone season NOx coal input emission rate (lb/MMBtu)","State ozone season NOx oil input emission rate (lb/MMBtu)","State ozone season NOx gas input emission rate (lb/MMBtu)","State ozone season NOx fossil fuel input emission rate (lb/MMBtu)","State annual SO2 coal input emission rate (lb/MMBtu)","State annual SO2 oil input emission rate (lb/MMBtu)","State annual SO2 gas input emission rate (lb/MMBtu)","State annual SO2 fossil fuel input emission rate (lb/MMBtu)","State annual CO2 coal input emission rate (lb/MMBtu)","State annual CO2 oil input emission rate (lb/MMBtu)","State annual CO2 gas input emission rate (lb/MMBtu)","State annual CO2 fossil fuel input emission rate (lb/MMBtu)","State annual Hg coal input emission rate (lb/BBtu)","State annual Hg fossil fuel input emission rate (lb/BBtu)","State annual NOx non-baseload output emission rate (lb/MWh)","State ozone season NOx non-baseload output emission rate (lb/MWh)","State annual SO2 non-baseload output emission rate (lb/MWh) ","State annual CO2 non-baseload  output emission rate (lb/MWh) ","State annual CH4 non-baseload output emission rate (lb/GWh)","State annual N2O non-baseload output emission rate (lb/GWh)","eGRID subregion annual CO2 equivalent non-baseload output emission rate (lb/MWh)","State annual Hg non-baseload  output emission rate (lb/GWh) ","State annual coal net generation (MWh)","State annual oil net generation (MWh)","State annual gas net generation (MWh)","State annual nuclear net generation (MWh)","State annual hydro net generation (MWh)","State annual biomass net generation (MWh)","State annual wind net generation (MWh)","State annual solar net generation (MWh)","State annual geothermal net generation (MWh)","State annual other fossil net generation (MWh)","State annual other unknown/ purchased fuel net generation (MWh)","State annual total nonrenewables net generation (MWh)","State annual total renewables net generation (MWh)","State annual total nonhydro renewables net generation (MWh)","State annual total combustion net generation (MWh)","State annual total noncombustion net generation (MWh)","State coal generation percent (resource mix)","State oil generation percent (resource mix)","State gas generation percent (resource mix)","State nuclear generation percent (resource mix)","State hydro generation percent (resource mix)","State biomass generation percent (resource mix)","State wind generation percent (resource mix)","State solar generation percent (resource mix)","State geothermal generation percent (resource mix)","State other fossil  generation percent (resource mix)","State other unknown/ purchased fuel generation percent (resource mix)","State total nonrenewables generation percent (resource mix)","State total renewables generation percent (resource mix)","State total nonhydro renewables generation percent (resource mix)","State total combustion generation percent (resource mix)","State total noncombustion generation percent (resource mix)",null,"Total Annual Heat Rate (Btu/kWh)","Fossil Annual Heat Rate (Btu/kWh)","Non-Baseload Annual Heat Rate (Btu/kWh)","Coal Annual Heat Rate (Btu/kWh)","Oil Annual Heat Rate (Btu/kWh)","Natural Gas Annual Heat Rate (Btu/kWh)",null,"Calculated Fossil CO2 - lb/MWh"]
[]
[]
[1,1,"US Average",null,1309394.6000000015,26820073797.080128,12638695177.892195,4045517914.7444024,1843039497.3380883,1913686.858242274,871745.09198158106,3817422.302762433,2298924483.3547387,96199568.677199394,64226468.254707657,2309886780.3524904,"N/A",0.94607755969518759,0.94598633750459193,1.8872353964120905,1136.5291326364011,23.77929617530252,15.87595694994358,1141.9486103046611,"N/A",0.14270556246199553,0.1379485903744955,0.2846690379485855,171.43312138127078,"N/A",1.3482405449851331,1.348110545647655,2.6894700685995074,1619.650145460454,33.887508382591903,22.624581495462905,"N/A",2.0270000000000001,3.3875000000000002,0.39729999999999999,1.3268,2.0017,3.1132,0.43190000000000001,1.2959000000000001,4.4062999999999999,13.383599999999999,8.4400000000000003E-2,2.5741000000000001,2173.9845285900478,1904.3003000000001,940.72305641832907,1640.1344999999999,"N/A","N/A",0.1925,0.32750000000000001,5.0099999999999999E-2,0.14130000000000001,0.189,0.32779999999999998,5.3199999999999997E-2,0.1371,0.41860000000000003,1.294,1.06E-2,0.27410000000000001,207.31939632518819,177.07578910169178,119.43912316493781,174.66069999999999,"N/A","N/A",1.3554999999999999,1.5557000000000001,2.9317000000000002,1549.3559,30.994,19.864699999999999,null,"N/A",1513655622.6472657,28456965.99530948,1225584924.397826,769331249,271170205.06999999,58270939.289264001,139474311.99000001,4188545.395,15544648,14899401.085735997,4941101.8760000002,3556869265.0021391,488648649.74426395,217478444.67426416,2838791438.7537961,1199708959.4550002,37.415620312310473,0.7034196015198565,30.294883133035363,19.016879055116153,6.7029787232355549,1.4403826782446862,3.4476256175178017,0.10353545536739105,0.38424370692675869,0.36829403304415598,0.12213768373121099,87.921233818757273,12.07876618129219,5.3757874580566414,70.171273458151333,29.655262558163663,null,{"$f":"F7*1000000/(H7*1000)","v":6629.5773155103261},{"$f":"(F7*((CT7+CU7+CV7+DC7)/DH7)*1000000/((CD7+CE7+CF7+CM7)*1000))","v":9447.7084265316407},{"$f":"1000*BY7/BS7","v":8870.6612306031057},{"$f":"1000*AX7/BP7","v":10486.160808514376},10754.153967973516,7876.1718228561549,null,{"$f":"DL7*BS7/1000","v":1650.1433671739148},null,{"$f":"DR7-AH7","v":30.493221713460798}]
[2,63,"ASCC Alaska Grid",null,2007.8,50103432.267028227,19891193.805571765,5331367.9560000002,2001058.1429999999,6915.8510314035366,2806.5336470109951,2108.7778844342511,3382036.9512384343,140402.66506710375,40490.484024481855,3389787.2042454341,"N/A",2.5944001946518571,2.8050495752246567,0.7910832273585624,1268.7313947003938,26.335204440183595,7.5947644879609681,1271.6388109849058,-0.57564963163836824,0.27606296489011906,0.28218855785567287,8.4176983053593446E-2,135.00220636437575,"N/A",2.8904687270102682,3.12515705619129,0.8813602981744757,1413.5168610136941,29.340533126188479,8.4614660786383151,"N/A",6.2821999999999996,2.6999,2.2475000000000001,2.8904999999999998,6.024,2.9056999999999999,2.5059,3.1031,3.5739999999999998,2.6446000000000001,3.8300000000000001E-2,0.88139999999999996,2165.0120000000002,1358.2603999999999,1273.3224,1413.5169000000001,"N/A","N/A",0.61680000000000001,0.3221,0.2064,0.27610000000000001,0.60770000000000002,0.32119999999999999,0.2155,0.28220000000000001,0.35089999999999999,0.3155,3.5000000000000001E-3,8.4199999999999997E-2,212.5771,162.04599999999999,116.9251,135.00219999999999,"N/A","N/A",2.5108000000000001,2.2915000000000001,0.30880000000000002,1377.7678000000001,28.6615,3.3794,1379.4173000000001,"N/A",684959.15500000003,613740.24200000009,3486580.5590000004,0,546088,0,0,0,0,0,0,4785279.9560000002,546088,0,4785279.9560000002,546088,12.847718646564937,11.511871757215477,65.397484993999541,0,10.242924602220045,0,0,0,0,0,0,89.757075397779957,10.242924602220045,0,89.757075397779957,10.242924602220045,null,9397.8567378079933,10470.32414565553,10205.521095211783,10184.596553438729,8381.9433987879984,10890.068941570287,null,1413.5167943766169,null,-6.6637077225095709E-5]
{"$rows_left_out":87}
{"sheet":"Profiles","index":12,"n_rows":26,"n_cols":12,"rows_kept":26,"cut":false,"hidden":true,"merged":[]}
["Displaced Electricity",{"$f":"deinput","v":2},{"$f":"LOOKUP(deinput,Lists!A25:A40,Lists!B25:B40)","v":"eGRID Fossil Fuel (2012 data)"}]
[null,{"$f":"IF(deinput<6,LOOKUP(deinput2,listb6a,listb6),\"N/A\")","v":"US Average"},"State/NERC Region"]
[]
[null,"NOx",{"$f":"LOOKUP(B1,B11:B26,H11:H26)","v":1.3268},"lb/MWh Average",null,"CH4",{"$f":"LOOKUP(B1,B11:B26,K11:K26)","v":3.3887508382591906E-2},"lb/MWh Average"]
[null,"SO2",{"$f":"LOOKUP(B1,B11:B26,I11:I26)","v":2.5741000000000001},"lb/MWh Average",null,"N2O",{"$f":"LOOKUP(B1,B11:B26,L11:L26)","v":2.2624581495462905E-2},"lb/MWh Average"]
[null,"CO2",{"$f":"LOOKUP(B1,B11:B26,J11:J26)","v":1640.1344999999999},"lb/MWh Average"]
[null,"Heat Rate",{"$f":"LOOKUP(B1,B11:B26,C11:C26)","v":9447.7084265316407},"Btu/kWh Average"]
[]
{"$rows_left_out":19}
{"sheet":"Factors","index":13,"n_rows":121,"n_cols":8,"rows_kept":121,"cut":false,"hidden":true,"merged":[]}
["Factors"]
[]
["General Emission Factors"]
[3.11,null,"gm/hp-hr to lb/MWh for recip engines"]
[{"$f":"12/44","v":0.27272727272727271},null,"ratio of carbon to CO2"]
[{"$f":"2000/2206","v":0.90661831368993651},null,"ratio of tonnes to tons",null,null,null,null,7.27]
[6.7720000000000002,null,"metric tons of Carbon per home",null,null,null,null,{"$f":"H6*CO2tocarbon","v":1.9827272727272724}]
[1.29,null,"metric tons of Carbon per car"]
{"$rows_left_out":114}
{"sheet":"Calc1","index":14,"n_rows":192,"n_cols":6,"rows_kept":192,"cut":false,"hidden":true,"merged":[]}
["Calculations"]
[]
["Total Emissions","CHP","Displaced Generation - Total","Displaced Thermal Supply - Total"]
["Number of CHP Units:",{"$f":"chpnumunits","v":1}]
["Generating Capacity (kW)",{"$f":"B28*chpnumunits","v":0}]
["CHP Generation (MWh/year)",{"$f":"IF(B155>0,dispgridelec,B29*chpnumunits)","v":0}]
["CHP fuel consumption (MMBtu/year)",{"$f":"B30*chpnumunits","v":0},{"$f":"C30*chpnumunits","v":0},{"$f":"D30*chpnumunits","v":0}]
["Duct Burner fuel (MMBtu/year)",{"$f":"B31*chpnumunits","v":0}]
{"$rows_left_out":184}