{"text_format":"1","workbook":"xlsx","n_sheets":15,"sheets":["Getting Started","Inputs","Results","SubThermalCalculator","SubGenSources","Biomass and Coal Data","Displaced Generation Profiles","Maps","Lists","STMTech","CHPTech","EGRID","Profiles","Factors","Calc1"],"not_rendered":{"charts":0,"images":12,"macros":1,"external_links":1,"defined_names":458,"comments":3,"pivot_tables":0},"unopened":[],"bounds":{"document_bytes":16777216,"sheet_cells":100000,"rows_first":2000,"rows_last":500,"rows_between":2000,"halvings":0,"cell_chars":16384,"cell_head_chars":4096},"cells_cut":0,"cells_raw":0,"read":"whole","date_system":"1900"}

{"sheet":"Getting Started","index":0,"n_rows":4,"n_cols":2,"rows_kept":4,"cut":false,"hidden":false,"merged":[[80,1,80,7],[82,1,82,7],[68,1,68,7],[79,1,79,7],[70,1,70,7],[72,1,72,7],[74,1,74,7],[76,1,76,7],[78,1,78,7],[106,1,106,6],[21,1,21,6],[23,1,23,6],[25,1,25,6],[27,1,27,6],[33,1,33,6],[102,1,102,6],[29,1,29,6],[35,1,35,6],[37,1,37,6],[39,1,39,6],[58,1,58,6],[60,1,60,7],[62,1,62,7],[64,1,64,7],[66,1,66,7],[17,1,17,6],[5,1,5,6],[7,1,7,6],[9,1,9,6],[11,1,11,6],[13,1,13,6]]}
[]
[]
[]
[null,"INTRODUCTION AND PURPOSE"]

{"sheet":"Inputs","index":1,"n_rows":218,"n_cols":5,"rows_kept":218,"cut":false,"hidden":false,"merged":[[157,0,157,2],[158,0,159,1],[17,2,20,2],[29,2,32,2],[136,1,136,2],[76,0,76,1],[152,3,156,3],[1,0,1,2],[144,0,144,1],[40,1,41,1],[91,0,92,0],[140,0,141,0],[116,0,117,0],[7,3,7,4]]}
[null,null," ",0]
["Energy Savings Inputs"]
["CHP System Characteristics"]
["1. CHP: Type of System",0]
[]
[null,1]
["2. CHP: Electricity Generating Capacity (per unit)"]
[null,{"$f":"IF(chptechinput>0,CONCATENATE(\"Normal size range for this technology is \",TEXT(caplow/chptechcaplow,\"#,###\"),\" to \",TEXT(caphigh/chptechcaphigh,\"#,###\"),\" kW\"),\" \")","v":" "}]
[null,0,"kW",{"$f":"CONCATENATE(allcheck1,\"   \",allcheck2,\"   \",allcheck4,\"   \",allcheck5,\"   \",allcheck6,\"   \",allcheck8,\"   \",allcheck9,\"   \",allcheck10,\"   \",allcheck11,\"   \",allcheck12,\"   \",allcheck13,\"   \",allcheck14,\"   \",allcheck15,\"   \",allcheck16)","v":"                                       "}]
[]
[]
["3. CHP: How Many Identical Units (i.e., engines) Does This System Have?",null,null,{"$f":"CONCATENATE(allcheck18,\"   \",allcheck19,\"   \",allcheck20,\"   \",allcheck21,\"   \",allcheck22,\"   \",allcheck23,\"   \",allcheck24,\"   \",allcheck25,\"   \",allcheck26,\"   \",allcheck7,\"   \")","v":"                              "}]
[null,1]
[]
[]
["4. CHP: Annual Utilization (Enter a value to answer only ONE of the options below)"]
["                    Option 1: How many hours per year does the CHP system operate?"]
[null,0]
[]
["As a number of hours per year",0]
["OR     As a percentage",0]
[]
["                    Option 2: How much grid electricity is displaced by CHP operation each year?"]
["Enter displaced grid electricity as MWh/year",0,"MWh/yr"]
[]
[]
["5. CHP: Does the System Provide Heating or Cooling or Both?"]
[null,0]
[]
[{"$f":"CONCATENATE(\"         If Heating and Cooling: How many of the \",TEXT(chours,\"#,###\"),\" hours are in cooling mode?\")","v":"         If Heating and Cooling: How many of the  hours are in cooling mode?"}]
[]
["As a number of hours per year",0]
[{"$f":"CONCATENATE(\"as a percentage of the \",TEXT(chours,\"#,###\"),\" hours?\")","v":"as a percentage of the  hours?"},0]
[]
[{"$f":"CONCATENATE(\"         If Heating and Cooling: Does the System Provide Simultaneous Heating and Cooling?\")","v":"         If Heating and Cooling: Does the System Provide Simultaneous Heating and Cooling?"}]
[null,0]
[]
[]
["6. CHP: Fuel"]
["Fuel Type",0]
[null,{"$f":"IF(chpfuelinput=7,\"Click on 'View Biomass and Coal Fuel Characteristics' to select the appropriate CO2 emissions rate and heat content for your fuel. \",\"\")","v":""}]
[null,null,{"$f":"IF(chptechinput>8,IF(chpfuelinput=8,\"\",\"Please enter a fuel type compatible with the CHP technology\"),IF(chptechinput<9,IF(chpfuelinput=8,\"Please enter a fuel type compatible with the CHP technology\",IF(chpfuelinput=0,\"\",IF(AND(chptechinput=3,chpfuelinput<>2),\"Please enter a fuel type compatible with the CHP technology\",IF(OR(chptechinput=6,chptechinput=8),\"\",IF(AND(OR(chptechinput<>6,chptechinput<>8),OR(chpfuelinput=4,chpfuelinput=6)),\"Please enter a fuel compatible with the CHP technology\",\"\")))))))","v":""}]
[]
["7. CHP: What is the Heat Content of this Fuel? (Enter a value in only ONE of the boxes)"]
[null,0,"Btu/cubic foot (HHV)"]
["OR   ",0,"Btu/gallon (HHV)"]
["OR   ",0,"Btu/lb (HHV)"]
[]
[]
["8. CHP: Boiler Steam To Process   (Steam Turbine CHP Only)"]
[]
["Boiler Steam to Process as lb Steam/hr",0,{"$f":"IF(AND(chptechinput<>6,OR(lbsteamperhr>0,mmbtusteamperhr>0)),\"Enter boiler steam to process only if steam turbine\",\" \")","v":" "}]
["Boiler Steam to Process as MMBtu Steam/hr",0,{"$f":"IF(AND(chptechinput=6,AND(lbsteamperhr>0,mmbtusteamperhr>0)),\"Please enter only lb/hr or MMBtu/hr\",\"\")","v":""}]
[]
[]
["9. CHP: Steam Turbine System Boiler Efficiency   (Steam Turbine CHP Only)"]
[]
[]
["Enter Boiler Efficiency as %",0,{"$f":"IF(AND(chptechinput=6,boilereff>0),\" \",IF(AND(chptechinput<>6,boilereff=0),\" \",\"Please enter an efficiency\"))","v":" "}]
[]
[]
["10. CHP: Electric Efficiency"]
[]
[0,{"$f":"IF(AND(OR(chptechinput=6,chptechinput=9,chptechinput=10),chpeffinput1>0),\"Electric efficiency is not used for this technology\",\"\")","v":""}]
["Enter Generating Efficiency as %",0,"(HHV)"]
["OR Enter Generating Efficiency as Btu/kWh HHV",0,"Btu/kWh (HHV)"]
["OR  Enter Generating Efficiency as Btu/kWh LHV",0,"Btu/kWh (LHV)"]
[]
[]
["11. CHP Equipment: Base Power to Heat Ratio"]
["          The Power to Heat Ratio should reflect ONLY the thermal production of the generating unit (i.e., combustion turbine)."]
["          Thermal Output of the duct burners (if equipped) should not be included. "]
[]
[null," See the SubThermalCalculator for help on calculating a Power to Heat Ratio"]
["Power to Heat Ratio (Generating Unit Capacity)",0,{"$f":"IF(chpphinput>0,IF(whptherminput>0,\"Enter only one value.\",\"\"),\"\")","v":""}]
["If WHP: Useful Thermal Output (MMBtu/hr)",0]
[{"$f":"IF(AND(chptechinput=9,whptherminput>0),\"Useful Thermal Output only applies to WHP with thermal output\",IF(AND(OR(chptechinput=1,chptechinput=2,chptechinput=3,chptechinput=4,chptechinput=5,chptechinput=6,chptechinput=7,chptechinput=8),whptherminput>0),\"Useful Thermal Output only applies to WHP - see the SubThermalCalculator tab for help calculating the Power to Heat Ratio\",\"\"))","v":""},null,{"$f":"IF(AND(OR(chptechinput=6,chptechinput=9),chpphinput>0),\"Power to Heat Ratio is not used for this technology\",\"\")","v":""}]
[]
["12. Duct Burners: Does the System Incorporate Duct Burners? (Duct Burners only allowed on Combustion Turbines)"]
[0,0]
[null,{"$f":"IF(AND(chptechinput<>5,chpduct1=1),\"Duct burners only allowed on Combustion Turbines\",\"\")","v":""}]
[]
["13. Duct Burners: What is the Total Fuel Input Capacity of the Burners for Each CHP Unit?"]
[{"$f":"IF(chptechinput<>0,CONCATENATE(\"         For reference, the \",CHPname,\" has a heat input of \",TEXT(cbtuperhour,\"#,###.#\"),\" MMBtu/hr\"),\" \")","v":" "}]
[null,0,"MMBtu/hr"]
[]
[]
[{"$f":"CONCATENATE(\"14. Duct Burners: The CHP system operates \",TEXT(chours,\"#,###\"),\" hours per year.  How much do the duct burners operate?\")","v":"14. Duct Burners: The CHP system operates  hours per year.  How much do the duct burners operate?"}]
["As a number of hours per year",0]
[{"$f":"CONCATENATE(\"As a percentage of the \",TEXT(chours,\"#,###\"),\" hours?\")","v":"As a percentage of the  hours?"},0,0]
[]
["CHP Cooling Characteristics"]
[]
["15. Cooling: Does the CHP Provide Cooling?",{"$f":"IF(coolinput1=1,\"Yes\",\"No\")","v":"No"}]
[{"$f":"IF(chpheatcoolboth=0,2,IF(chpheatcoolboth=1,2,1))","v":2},{"$f":"IF(coolinput1=1,\"You indicated Cooling in Item 5\",\"You indicated No Cooling in Item 5\")","v":"You indicated No Cooling in Item 5"}]
[]
["16. Cooling: What is the Coefficient of Performance (COP) of the Absorption Chiller Used?"]
[null,0,0]
[]
["Coefficient of Performance (COP) ",0]
[]
[]
["17. Cooling: What is the Cooling Capacity of the System?",null,0]
[{"$f":"IF(chpheatcoolboth<>0,CONCATENATE(\"      Based on your other entries, the maximum cooling capacity is \",TEXT(coolavailabletons,\"#,###.#\"),\" tons or \",TEXT(coolavailableMMBtu,\"#,###.#\"),\" MMBtu/hr of cooling\"),\" \")","v":" "}]
[]
[" (Enter a value in only ONE of the boxes)",0,"Cooling Tons"]
[null,0,"OR   MMBtu per Hour of Cooling"]
[]
[]
["18. Displaced Cooling: What is the Efficiency of the Cooling System that is Being Displaced?"]
[null,0]
[null,null,0]
[" (Enter a value in only ONE of the boxes)"]
["Electricity Demand (kW per ton) ",0]
["OR     Coefficient of Performance (COP) ",0]
[]
["Thermal Characteristics"]
[]
["19. Displaced Thermal: Type of System:",0]
[]
[]
["20. Displaced Thermal: What is the Heat Content of the displaced Fuel? (Enter a value in only ONE of the boxes)"]
[null,0,"Btu/cubic foot (HHV)"]
["OR   ",0,"Btu/gallon (HHV)"]
["OR   ",0,"Btu/lb (HHV)"]
[]
[]
["21. Displaced Thermal: Efficiency (usually a boiler)"]
[]
["Enter Generating Efficiency as %",0]
[]
[]
["22. Thermal Utilization (Enter a value to answer only ONE of the options below)"]
["           Option 1: CHP Thermal Utilization - What is the percent of available CHP thermal output utilized throughout the year?"]
[]
["Enter thermal utilization as a %",0]
["(also applies to cooling)"," "]
["           Option 2: Displaced boiler fuel - What is the quantity of boiler fuel displaced throughout the year?"]
["Enter displaced boiler fuel as MMBtu/year",0,"MMBtu/yr"]
[]
["Electricity Profile"]
[]
["23. Displaced Electricity: Electricity Generation Profile"]
[null,2]
["      Link to Guidelines for Displaced Electricity Generation Profile"]
[]
[]
["24. Displaced Electricity: Select U.S. Average, eGRID Subregion, NERC region, or State"]
[null,1]
["Link to eGRID Subregion Map"]
[]
[]
["25. Displaced Electricity: Select Electric Grid Region for Transmission and Distribution (T&D) Losses",null,null,"*Stop entering inputs here to calculate ONLY energy savings - continue entering inputs to calculate energy AND emissions savings"]
[null,1]
[null,8.3299999999999999E-2]
["Link to NERC Interconnections Map"]
[]
["Emissions Savings Inputs"]
["CHP & Displaced Boiler Emissions Characteristics"]
[]
["26. CHP: If Biomass, Diesel, Distillate, Coal or Other: What is the Sulfur Content?"]
["If WHP, what is the sulfur content of the stack?"]
[null,"            or"]
[0]
[null,null,null,null,27]
["Enter Sulfur Content of Fuel as a percent",0]
["OR   ppm",0,"ppm"]
[]
[]
["27. CHP: What is the CO2 Emission Rate for this Fuel? (default completed for fuel in Item 6)"]
["Enter alternative value:",0,"lb CO2/MMBtu"]
[]
[]
["28. CHP: NOx Emission Rate"]
[]
[0,2]
[]
["Enter a NOx Rate as ppm (15% O2)",0,"ppm"]
["OR      Enter a NOx Rate as gm/hp-hr",0,"gm/hp-hr"]
["OR     Enter a NOx Rate as lb/MMBtu",0,"lb NOx/MMBtu"]
["OR        Enter a NOx Rate as lb/MWh",0,"lb NOx/MWh"]
[]
[]
["29. Duct Burners: NOx Emission Rate for the Duct Burners"]
[null,2]
[0,{"$f":"IF(AND(chptechinput<>5,OR(chpduct3>0,chpduct4>0)),\"Duct burners only allowed on Combustion Turbines\",\"\")","v":""}]
[0,0,"lb/MMBtu"]
["OR    ",0,"ppm NOx at 15% O2"]
[]
[]
["30. Displaced Thermal: What is the CO2 Emission Rate for this Fuel?  (default completed for fuel in Item 23)"]
["Enter alternative value:",0,"lb CO2/MMBtu"]
[]
[]
["31. Displaced Thermal: If Biomass, Diesel, Distillate, Coal or Other: What is the Sulfur Content?"]
[null,1]
[null,"          or"]
[]
[0]
["Enter Sulfur Content as a percent",0]
["OR    ppm",0,"ppm"]
[]
[]
["32. Displaced Thermal Production: NOx Emission Rate"]
[]
["NOx Rate",0,"lb NOx/MMBtu"]
[]
[]
[]
[]
[]
["CHP Fuel"]
[{"$f":"LOOKUP(chpfuelinput,lista6a,lista6c)","v":{"$error":"#N/A"}},"co2 flag"]
[{"$f":"LOOKUP(chpfuelinput, lista6a, lista6f)","v":{"$error":"#N/A"}},"heat content flag"]
["Displaced Thermal Production Fuel"]
[{"$f":"LOOKUP(stminput1,listd2a,listd2c)","v":{"$error":"#N/A"}},"so2 flag"]
[{"$f":"LOOKUP(stminput1,listd2a,listd2c)","v":{"$error":"#N/A"}},"co2 flag"]
[{"$f":"LOOKUP(stminput1, listd2a, listd2f)","v":{"$error":"#N/A"}},"heat content flag"]

{"sheet":"Results","index":2,"n_rows":173,"n_cols":7,"rows_kept":173,"cut":false,"hidden":false,"merged":[[142,3,142,4],[5,0,5,5],[6,0,6,4],[7,0,7,5],[14,0,14,3],[127,0,127,5],[89,0,89,5],[55,0,55,5],[90,0,90,5],[31,0,31,3],[32,0,32,3],[42,2,42,5],[13,0,13,3]]}
["CHP Results"]
[]
[]
[]
[]
["The results generated by the CHP Emissions Calculator are intended for educational and outreach purposes only; "]
["it is not designed for use in developing emission inventories or preparing air permit applications."]
["The results of this analysis have not been reviewed or endorsed by the EPA CHP Partnership."]
[]
["Table 1: Energy Savings"]
["Annual Energy Savings Analysis"]
[null,"CHP System","Displaced Electricity Production","Displaced Thermal Production","Fuel Reduction","Percent Reduction"]
["Fuel Consumption (MMBtu/year)",{"$f":"IFERROR(E102,\"-\")","v":0},{"$f":"IFERROR(F126,\"-\")","v":0},{"$f":"IFERROR(E114,\"-\")","v":0},{"$f":"IFERROR(C13+D13-B13,\"-\")","v":0},{"$f":"IF(OR(chptechinput=9,chptechinput=10),IFERROR(E13/(C13+D13),\"-\"),IF(B13<=0,\"-\",IFERROR(E13/(C13+D13),\"-\")))","v":"-"}]
["Equal to the annual energy consumption from this many passenger vehicles:",null,null,null,{"$f":"IFERROR((E13/mmbtugalgas)/galvehicle,\"-\")","v":0}]
["Equal to the annual energy consumption from the generation of electricity for this many homes:",null,null,null,{"$f":"IFERROR($E$13*(3412/VLOOKUP(deinput,SubGenSources!$B$6:$F$17,5,FALSE))/(homes2*kWhtoMMBtu),\"-\")","v":0}]
[]
[]
[]
[]
[]
[]
["Table 2: Emissions Savings"]
["Annual Emissions Analysis"]
[null,"CHP System","Displaced Electricity Production","Displaced Thermal Production","Emissions Reduction","Percent Reduction"]
["NOx (tons/year)",{"$f":"IF(AND(OR(chpsulfurinput2=\"0\",chpsulfurinput2=\"\"),OR(chpnoxinput1=\"0\",chpnoxinput1=\"\"),OR(chpnoxinput2=\"0\",chpnoxinput2=\"\"),OR(chpnoxinput3=\"0\",chpnoxinput3=\"\"),OR(chpnoxinput4=\"0\",chpnoxinput4=\"\"),OR(stmsulfurinput2=\"0\",stmsulfurinput2=\"\"),OR(stmnoxinput=\"0\",stmnoxinput=\"\")),\"-\",E95)","v":0},{"$f":"IF(chptechinput=9,F119,IF(AND(OR(chpsulfurinput2=0,ISBLANK(chpsulfurinput)),OR(chpnoxinput1=0,ISBLANK(chpnoxinput1)),OR(chpnoxinput2=0,ISBLANK(chpnoxinput2)),OR(chpnoxinput3=0,ISBLANK(chpnoxinput3)),OR(chpnoxinput4=0,ISBLANK(chpnoxinput4)),OR(stmsulfurinput2=0,ISBLANK(stmsulfurinput2)),OR(stmnoxinput=0,ISBLANK(stmnoxinput))),\"-\",F119))","v":"-"},{"$f":"IF(AND(OR(chpsulfurinput2=0,ISBLANK(chpsulfurinput)),OR(chpnoxinput1=0,ISBLANK(chpnoxinput1)),OR(chpnoxinput2=0,ISBLANK(chpnoxinput2)),OR(chpnoxinput3=0,ISBLANK(chpnoxinput3)),OR(chpnoxinput4=0,ISBLANK(chpnoxinput4)),OR(stmsulfurinput2=0,ISBLANK(stmsulfurinput2)),OR(stmnoxinput=0,ISBLANK(stmnoxinput))),\"-\",E107)","v":"-"},{"$f":"IF(chptechinput=9,C25,IFERROR(IF(B25=\"-\",C25+D25,IFERROR(C25+D25-B25,\"-\")),\"-\"))","v":"-"},{"$f":"IF(chptechinput=9,E25/C25,IF(chptechinput=10,IFERROR(E25/(C25+D25),\"-\"),IF(B25<=0,\"-\",IFERROR(E25/(C25+D25),\"-\"))))","v":"-"}]
["SO2 (tons/year)",{"$f":"IF(AND(OR(chpsulfurinput2=0,ISBLANK(chpsulfurinput)),OR(chpnoxinput1=0,ISBLANK(chpnoxinput1)),OR(chpnoxinput2=0,ISBLANK(chpnoxinput2)),OR(chpnoxinput3=0,ISBLANK(chpnoxinput3)),OR(chpnoxinput4=0,ISBLANK(chpnoxinput4)),OR(stmsulfurinput2=0,ISBLANK(stmsulfurinput2)),OR(stmnoxinput=0,ISBLANK(stmnoxinput))),\"-\",E96)","v":"-"},{"$f":"IF(chptechinput=9,F120,IF(AND(OR(chpsulfurinput2=0,ISBLANK(chpsulfurinput)),OR(chpnoxinput1=0,ISBLANK(chpnoxinput1)),OR(chpnoxinput2=0,ISBLANK(chpnoxinput2)),OR(chpnoxinput3=0,ISBLANK(chpnoxinput3)),OR(chpnoxinput4=0,ISBLANK(chpnoxinput4)),OR(stmsulfurinput2=0,ISBLANK(stmsulfurinput2)),OR(stmnoxinput=0,ISBLANK(stmnoxinput))),\"-\",F120))","v":"-"},{"$f":"IF(AND(OR(chpsulfurinput2=0,ISBLANK(chpsulfurinput)),OR(chpnoxinput1=0,ISBLANK(chpnoxinput1)),OR(chpnoxinput2=0,ISBLANK(chpnoxinput2)),OR(chpnoxinput3=0,ISBLANK(chpnoxinput3)),OR(chpnoxinput4=0,ISBLANK(chpnoxinput4)),OR(stmsulfurinput2=0,ISBLANK(stmsulfurinput2)),OR(stmnoxinput=0,ISBLANK(stmnoxinput))),\"-\",E108)","v":"-"},"-","-"]
["CO2 (tons/year)",{"$f":"IF(AND(OR(chpsulfurinput2=0,ISBLANK(chpsulfurinput)),OR(chpnoxinput1=0,ISBLANK(chpnoxinput1)),OR(chpnoxinput2=0,ISBLANK(chpnoxinput2)),OR(chpnoxinput3=0,ISBLANK(chpnoxinput3)),OR(chpnoxinput4=0,ISBLANK(chpnoxinput4)),OR(stmsulfurinput2=0,ISBLANK(stmsulfurinput2)),OR(stmnoxinput=0,ISBLANK(stmnoxinput))),\"-\",E97)","v":"-"},{"$f":"IF(chptechinput=9,F121,IF(AND(OR(chpsulfurinput2=0,ISBLANK(chpsulfurinput)),OR(chpnoxinput1=0,ISBLANK(chpnoxinput1)),OR(chpnoxinput2=0,ISBLANK(chpnoxinput2)),OR(chpnoxinput3=0,ISBLANK(chpnoxinput3)),OR(chpnoxinput4=0,ISBLANK(chpnoxinput4)),OR(stmsulfurinput2=0,ISBLANK(stmsulfurinput2)),OR(stmnoxinput=0,ISBLANK(stmnoxinput))),\"-\",F121))","v":"-"},{"$f":"IF(AND(OR(chpsulfurinput2=0,ISBLANK(chpsulfurinput)),OR(chpnoxinput1=0,ISBLANK(chpnoxinput1)),OR(chpnoxinput2=0,ISBLANK(chpnoxinput2)),OR(chpnoxinput3=0,ISBLANK(chpnoxinput3)),OR(chpnoxinput4=0,ISBLANK(chpnoxinput4)),OR(stmsulfurinput2=0,ISBLANK(stmsulfurinput2)),OR(stmnoxinput=0,ISBLANK(stmnoxinput))),\"-\",E109)","v":"-"},"-","-"]
["CH4 (tons/year)",{"$f":"IF(AND(OR(chpsulfurinput2=0,ISBLANK(chpsulfurinput)),OR(chpnoxinput1=0,ISBLANK(chpnoxinput1)),OR(chpnoxinput2=0,ISBLANK(chpnoxinput2)),OR(chpnoxinput3=0,ISBLANK(chpnoxinput3)),OR(chpnoxinput4=0,ISBLANK(chpnoxinput4)),OR(stmsulfurinput2=0,ISBLANK(stmsulfurinput2)),OR(stmnoxinput=0,ISBLANK(stmnoxinput))),\"-\",E98)","v":"-"},{"$f":"IF(chptechinput=9,F122,IF(AND(OR(chpsulfurinput2=0,ISBLANK(chpsulfurinput)),OR(chpnoxinput1=0,ISBLANK(chpnoxinput1)),OR(chpnoxinput2=0,ISBLANK(chpnoxinput2)),OR(chpnoxinput3=0,ISBLANK(chpnoxinput3)),OR(chpnoxinput4=0,ISBLANK(chpnoxinput4)),OR(stmsulfurinput2=0,ISBLANK(stmsulfurinput2)),OR(stmnoxinput=0,ISBLANK(stmnoxinput))),\"-\",F122))","v":"-"},{"$f":"IF(AND(OR(chpsulfurinput2=0,ISBLANK(chpsulfurinput)),OR(chpnoxinput1=0,ISBLANK(chpnoxinput1)),OR(chpnoxinput2=0,ISBLANK(chpnoxinput2)),OR(chpnoxinput3=0,ISBLANK(chpnoxinput3)),OR(chpnoxinput4=0,ISBLANK(chpnoxinput4)),OR(stmsulfurinput2=0,ISBLANK(stmsulfurinput2)),OR(stmnoxinput=0,ISBLANK(stmnoxinput))),\"-\",E110)","v":"-"},"-","-"]
["N2O (tons/year)",{"$f":"IF(AND(OR(chpsulfurinput2=0,ISBLANK(chpsulfurinput)),OR(chpnoxinput1=0,ISBLANK(chpnoxinput1)),OR(chpnoxinput2=0,ISBLANK(chpnoxinput2)),OR(chpnoxinput3=0,ISBLANK(chpnoxinput3)),OR(chpnoxinput4=0,ISBLANK(chpnoxinput4)),OR(stmsulfurinput2=0,ISBLANK(stmsulfurinput2)),OR(stmnoxinput=0,ISBLANK(stmnoxinput))),\"-\",E99)","v":"-"},{"$f":"IF(chptechinput=9,F123,IF(AND(OR(chpsulfurinput2=0,ISBLANK(chpsulfurinput)),OR(chpnoxinput1=0,ISBLANK(chpnoxinput1)),OR(chpnoxinput2=0,ISBLANK(chpnoxinput2)),OR(chpnoxinput3=0,ISBLANK(chpnoxinput3)),OR(chpnoxinput4=0,ISBLANK(chpnoxinput4)),OR(stmsulfurinput2=0,ISBLANK(stmsulfurinput2)),OR(stmnoxinput=0,ISBLANK(stmnoxinput))),\"-\",F123))","v":"-"},{"$f":"IF(AND(OR(chpsulfurinput2=0,ISBLANK(chpsulfurinput)),OR(chpnoxinput1=0,ISBLANK(chpnoxinput1)),OR(chpnoxinput2=0,ISBLANK(chpnoxinput2)),OR(chpnoxinput3=0,ISBLANK(chpnoxinput3)),OR(chpnoxinput4=0,ISBLANK(chpnoxinput4)),OR(stmsulfurinput2=0,ISBLANK(stmsulfurinput2)),OR(stmnoxinput=0,ISBLANK(stmnoxinput))),\"-\",E111)","v":"-"},"-","-"]
["Total GHGs (CO2e tons/year)",{"$f":"IF(AND(OR(chpsulfurinput2=0,ISBLANK(chpsulfurinput)),OR(chpnoxinput1=0,ISBLANK(chpnoxinput1)),OR(chpnoxinput2=0,ISBLANK(chpnoxinput2)),OR(chpnoxinput3=0,ISBLANK(chpnoxinput3)),OR(chpnoxinput4=0,ISBLANK(chpnoxinput4)),OR(stmsulfurinput2=0,ISBLANK(stmsulfurinput2)),OR(stmnoxinput=0,ISBLANK(stmnoxinput))),\"-\",E100)","v":"-"},{"$f":"IF(chptechinput=9,F124,IF(AND(OR(chpsulfurinput2=0,ISBLANK(chpsulfurinput)),OR(chpnoxinput1=0,ISBLANK(chpnoxinput1)),OR(chpnoxinput2=0,ISBLANK(chpnoxinput2)),OR(chpnoxinput3=0,ISBLANK(chpnoxinput3)),OR(chpnoxinput4=0,ISBLANK(chpnoxinput4)),OR(stmsulfurinput2=0,ISBLANK(stmsulfurinput2)),OR(stmnoxinput=0,ISBLANK(stmnoxinput))),\"-\",F124))","v":"-"},{"$f":"IF(AND(OR(chpsulfurinput2=0,ISBLANK(chpsulfurinput)),OR(chpnoxinput1=0,ISBLANK(chpnoxinput1)),OR(chpnoxinput2=0,ISBLANK(chpnoxinput2)),OR(chpnoxinput3=0,ISBLANK(chpnoxinput3)),OR(chpnoxinput4=0,ISBLANK(chpnoxinput4)),OR(stmsulfurinput2=0,ISBLANK(stmsulfurinput2)),OR(stmnoxinput=0,ISBLANK(stmnoxinput))),\"-\",E112)","v":"-"},"-","-"]
["Carbon (metric tons/year)",{"$f":"IF(AND(OR(chpsulfurinput2=0,ISBLANK(chpsulfurinput)),OR(chpnoxinput1=0,ISBLANK(chpnoxinput1)),OR(chpnoxinput2=0,ISBLANK(chpnoxinput2)),OR(chpnoxinput3=0,ISBLANK(chpnoxinput3)),OR(chpnoxinput4=0,ISBLANK(chpnoxinput4)),OR(stmsulfurinput2=0,ISBLANK(stmsulfurinput2)),OR(stmnoxinput=0,ISBLANK(stmnoxinput))),\"-\",E101)","v":"-"},{"$f":"IF(chptechinput=9,F125,IF(AND(OR(chpsulfurinput2=0,ISBLANK(chpsulfurinput)),OR(chpnoxinput1=0,ISBLANK(chpnoxinput1)),OR(chpnoxinput2=0,ISBLANK(chpnoxinput2)),OR(chpnoxinput3=0,ISBLANK(chpnoxinput3)),OR(chpnoxinput4=0,ISBLANK(chpnoxinput4)),OR(stmsulfurinput2=0,ISBLANK(stmsulfurinput2)),OR(stmnoxinput=0,ISBLANK(stmnoxinput))),\"-\",F125))","v":"-"},{"$f":"IF(AND(OR(chpsulfurinput2=0,ISBLANK(chpsulfurinput)),OR(chpnoxinput1=0,ISBLANK(chpnoxinput1)),OR(chpnoxinput2=0,ISBLANK(chpnoxinput2)),OR(chpnoxinput3=0,ISBLANK(chpnoxinput3)),OR(chpnoxinput4=0,ISBLANK(chpnoxinput4)),OR(stmsulfurinput2=0,ISBLANK(stmsulfurinput2)),OR(stmnoxinput=0,ISBLANK(stmnoxinput))),\"-\",E113)","v":"-"},"-","-"]
["Equal to the annual GHG emissions from this many passenger vehicles:",null,null,null,{"$f":"IFERROR($E$31/cars,\"-\")","v":"-"}]
["Equal to the annual GHG emissions from the generation of electricity for this many homes:",null,null,null,{"$f":"IFERROR($E$31/homes,\"-\")","v":"-"}]
[]
[]
[]
[]
[]
[]
[null,null,{"$f":"IFERROR(CONCATENATE(\"This CHP project will avoid yearly emissions of greenhouse gases by \",TEXT(ROUND(E30,0),\"#,###\"),\" tons of carbon dioxide equivalent.\"),\"\")","v":""}]
[]
[null,{"$f":"IF(B33>=0,\"Equal to the annual greenhouse\",\"Equal to the annual greenhouse\")","v":"Equal to the annual greenhouse"},null,null,{"$f":"IF(E33>=0,\"Equal to the annual greenhouse\",\"Equal to the annual greenhouse\")","v":"Equal to the annual greenhouse"}]
[null,{"$f":"IF(B33>=0,\"gas emissions from        \",\"gas emissions from        \")","v":"gas emissions from        "},{"$f":"IF(E33>=0,\"gas emissions from the generation of        \",\"        gas emissions from the generation of        \")","v":"gas emissions from the generation of        "}]
[null,{"$f":"IFERROR(CONCATENATE(TEXT(ROUND(ABS(E32),0),\"#,###\"),\" passenger vehicles.                            \"),\"\")","v":""},null,null,{"$f":"IFERROR(CONCATENATE(\"  electricity used by \",TEXT(ROUND(ABS(E33),0),\"#,###\"),\" homes.                            \"),\"\")","v":""}]
[]
[]
[]
[]
[]
[]
[]
[]
[]
[]
[]
["The results of this analysis have not been reviewed or endorsed by the EPA CHP Partnership."]
["Table 3: CHP Technology and Generation Profile"]
["CHP Technology:",{"$f":"IFERROR(CHPname,\"\")","v":""}]
["Fuel:",{"$f":"IFERROR(cfuel,\"\")","v":""}]
["Unit Capacity:",{"$f":"IFERROR(Calc1!B28,\"-\")","v":0},"kW"]
["Number of Units:",{"$f":"IFERROR(Calc1!B4,\"-\")","v":1}]
["Total CHP Capacity:",{"$f":"IFERROR(Calc1!B5,\"-\")","v":0},"kW"]
["Operation:",{"$f":"IFERROR(chours,\"-\")","v":0},"hours per year"]
["Heat Rate:",{"$f":"IFERROR(IF(chr=FALSE,0,chr),\"-\")","v":0},"Btu/kWh HHV"]
["CHP Fuel Consumption:",{"$f":"IFERROR(Calc1!B7,\"-\")","v":0},"MMBtu/year"]
["Duct Burner Fuel Consumption:",{"$f":"IFERROR(Calc1!B8,\"-\")","v":0},"MMBtu/year"]
["Total Fuel Consumption:",{"$f":"IFERROR(B65+B66,\"-\")","v":0},"MMBtu/year"]
["Total CHP Generation:",{"$f":"IFERROR(Calc1!B6,\"-\")","v":0},"MWh/year"]
["Useful CHP Thermal Output:",{"$f":"IFERROR(Calc1!D170,\"-\")","v":0},"MMBtu/year for thermal applications (non-cooling)"]
[null,{"$f":"IFERROR(Calc1!B167,\"-\")","v":0},"MMBtu/year for electric applications (cooling and electric heating)"]
[null,{"$f":"IFERROR(B69+B70,\"-\")","v":0},"MMBtu/year Total"]
["Table 4: Displaced Thermal"]
["Displaced On-Site Production for",null,{"$f":"IF(stminput1<>0,LOOKUP(stminput1,listd2a,listd2),\" \")","v":" "}]
["Thermal (non-cooling) Applications:",{"$f":"IFERROR(IF(stminput1<>0,Calc1!B182,\" \"),\"-\")","v":" "},{"$f":"IF(stminput1<>0,\"lb/MMBtu NOx\",\"There is no displaced thermal production\")","v":"There is no displaced thermal production"}]
[null,{"$f":"IFERROR(IF(stminput1<>0,Calc1!B174,\" \"),\"-\")","v":" "},{"$f":"IF(stminput1<>0,\"sulfur content\",\" \")","v":" "}]
["Displaced Electric Service (cooling and electric heating):",{"$f":"IF(coolinput1=1,Calc1!B127*1000000/12000,\" \")","v":" "},{"$f":"IF(coolinput1=1,\"tons of cooling capacity from CHP system\",\"\")","v":""}]
[{"$f":"IF(coolinput1=1,\"CHP:\",\" \")","v":" "},{"$f":"IF(coolinput1=1,Calc1!C118,\"There is no displaced cooling service\")","v":"There is no displaced cooling service"}]
[{"$f":"IF(coolinput1=1,\"Replaces:\",\" \")","v":" "},{"$f":"IF(coolinput1=1,IF(cooldisp1<10,Calc1!C134,\"User Defined \"),\" \")","v":" "}]
[null,{"$f":"IF(coolinput1=1,Calc1!B135,\" \")","v":" "},{"$f":"IF(coolinput1=1,\"COP\",\" \")","v":" "}]
["Table 5: Displaced Electricity"]
["Displaced Electricity Profile:",{"$f":"LOOKUP(deinput,listb5a,listb5)","v":"eGRID Fossil Fuel (2012 data)"}]
[]
["Egrid State:",{"$f":"IFERROR(IF(deinput<6,LOOKUP(deinput2,listb6a,listb6),\"N/A\"),\"-\")","v":"US Average"}]
["Distribution Losses:",{"$f":"IFERROR(lossinput,\"-\")","v":8.3299999999999999E-2}]
["Displaced Electricity Production:",{"$f":"IFERROR(Calc1!B6,\"-\")","v":0},"MWh/year CHP generation"]
[null,{"$f":"IFERROR(Calc1!B150*chpnumunits,\"-\")","v":0},"MWh/year Displaced Electric Demand (cooling)"]
[null,{"$f":"IFERROR(IF(stminput1=9,Calc1!B151*chpnumunits,0),\"-\")","v":0},"MWh/year Displaced Electric Demand (electric heating)"]
[null,{"$f":"IFERROR((B85+B86+B87)/(1-lossinput)-(B85+B86+B87),\"-\")","v":0},"MWh/year Transmission Losses"]
[null,{"$f":"IFERROR(B85+B86+B87+B88,\"-\")","v":0},"MWh/year Total"]
[]
["The results of this analysis have not been reviewed or endorsed by the EPA CHP Partnership."]
["Table 6"]
["Annual Analysis for CHP"]
[null,{"$f":"IFERROR(CONCATENATE(\"CHP System: \",CHPname),\"\")","v":""},{"$f":"IF(chpduct1=1,CONCATENATE(\"CHP System: \",\"Duct Burners\",\" \"),\" \")","v":" "},null,"Total Emissions from CHP System"]
["NOx (tons/year)",{"$f":"IFERROR(Calc1!B17,\"-\")","v":0},{"$f":"IFERROR(Calc1!B22,\"-\")","v":0},null,{"$f":"IFERROR(B95+C95,\"-\")","v":0}]
["SO2 (tons/year)",{"$f":"IFERROR(Calc1!B18,\"-\")","v":0},{"$f":"IFERROR(Calc1!B23,\"-\")","v":"-"},null,"-"]
["CO2 (tons/year)",{"$f":"IFERROR(Calc1!B19,\"-\")","v":0},{"$f":"IFERROR(Calc1!B24,\"-\")","v":"-"},null,"-"]
["CH4 (tons/year)",{"$f":"IFERROR(Calc1!F17,\"-\")","v":"-"},{"$f":"IFERROR(Calc1!F22,\"-\")","v":0},null,"-"]
["N2O (tons/year)",{"$f":"IFERROR(Calc1!F18,\"-\")","v":"-"},{"$f":"IFERROR(Calc1!F23,\"-\")","v":0},null,"-"]
["Total GHGs (CO2e tons/year)",{"$f":"IFERROR(B97+(B98*ch4GWP)+(B99*n2oGWP),\"-\")","v":"-"},{"$f":"IFERROR(C97+(C98*ch4GWP)+(C99*n2oGWP),\"-\")","v":"-"},null,"-"]
["Carbon (metric tons/year)",{"$f":"B97*CO2tocarbon*tonnes","v":0},{"$f":"IFERROR(C97*CO2tocarbon*tonnes,\"-\")","v":"-"},null,{"$f":"IFERROR(B101+C101,\"-\")","v":"-"}]
["Fuel Consumption (MMBtu/year)",{"$f":"IFERROR(B65,\"-\")","v":0},{"$f":"IFERROR(B66,\"-\")","v":0},null,{"$f":"IFERROR(B102+C102,\"-\")","v":0}]
[]
["Table 7"]
["Annual Analysis for Displaced Production for Thermal (non-cooling) Applications"]
[null,null,null,null,"Total Displaced Emissions from Thermal Production"]
["NOx (tons/year)",null,null,null,{"$f":"IFERROR(Calc1!D12,\"-\")","v":0}]
["SO2 (tons/year)",null,null,null,{"$f":"IFERROR(Calc1!D13,\"-\")","v":0}]
["CO2 (tons/year)",null,null,null,{"$f":"IFERROR(Calc1!D14,\"-\")","v":0}]
["CH4 (tons/year)",null,null,null,{"$f":"IFERROR(Calc1!E183,\"-\")","v":0}]
["N2O (tons/year)",null,null,null,{"$f":"IFERROR(Calc1!E185,\"-\")","v":0}]
["Total GHGs (CO2e tons/year)",null,null,null,{"$f":"IFERROR(E109+(E110*ch4GWP)+(E111*n2oGWP),\"-\")","v":0}]
["Carbon (metric tons/year)",null,null,null,{"$f":"IFERROR(E109*CO2tocarbon*tonnes,\"-\")","v":0}]
["Fuel Consumption (MMBtu/year)",null,null,null,{"$f":"IFERROR(IF(stminput1=9,0,dsbtu),\"-\")","v":0}]
[]
["Table 8"]
["Annual Analysis for Displaced Electricity Production"]
[null,"Displaced CHP Electricity Generation","Displaced Electricity for Cooling","Displaced Electricity for Heating","Transmission Losses","Total Displaced Emissions from Electricity Generation"]
["NOx (tons/year)",{"$f":"IFERROR((denoxrate/2000)*B85,\"-\")","v":0},{"$f":"IFERROR((denoxrate/2000)*B86,\"-\")","v":0},{"$f":"IFERROR((denoxrate/2000)*B87,\"-\")","v":0},{"$f":"IFERROR((denoxrate/2000)*B88,\"-\")","v":0},{"$f":"IFERROR(SUM(B119:E119),\"-\")","v":0}]
["SO2 (tons/year)",{"$f":"IFERROR((deso2rate/2000)*B85,\"-\")","v":0},{"$f":"IFERROR((deso2rate/2000)*B86,\"-\")","v":0},{"$f":"IFERROR((deso2rate/2000)*B87,\"-\")","v":0},{"$f":"IFERROR((deso2rate/2000)*B88,\"-\")","v":0},0]
["CO2 (tons/year)",{"$f":"IFERROR((deco2rate/2000)*B85,\"-\")","v":0},{"$f":"IFERROR((deco2rate/2000)*B86,\"-\")","v":0},{"$f":"IFERROR((deco2rate/2000)*B87,\"-\")","v":0},{"$f":"IFERROR((deco2rate/2000)*B88,\"-\")","v":0},0]
["CH4 (tons/year)",{"$f":"IFERROR((dech4rate/2000)*B85,\"-\")","v":0},{"$f":"IFERROR((dech4rate/2000)*B86,\"-\")","v":0},{"$f":"IFERROR((dech4rate/2000)*B87,\"-\")","v":0},{"$f":"IFERROR((dech4rate/2000)*B88,\"-\")","v":0},0]
["N2O (tons/year)",{"$f":"IFERROR((den2orate/2000)*B85,\"-\")","v":0},{"$f":"IFERROR((den2orate/2000)*B86,\"-\")","v":0},{"$f":"IFERROR((den2orate/2000)*B87,\"-\")","v":0},{"$f":"IFERROR((den2orate/2000)*B88,\"-\")","v":0},0]
["Total GHGs (CO2e tons/year)",{"$f":"IFERROR(B121+(B122*ch4GWP)+(B123*n2oGWP),\"-\")","v":0},{"$f":"IFERROR(C121+(C122*ch4GWP)+(C123*n2oGWP),\"-\")","v":0},{"$f":"IFERROR(D121+(D122*ch4GWP)+(D123*n2oGWP),\"-\")","v":0},{"$f":"IFERROR(E121+(E122*ch4GWP)+(E123*n2oGWP),\"-\")","v":0},0]
["Carbon (metric tons/year)",{"$f":"IFERROR(B121*CO2tocarbon*tonnes,\"-\")","v":0},{"$f":"IFERROR(C121*CO2tocarbon*tonnes,\"-\")","v":0},{"$f":"IFERROR(D121*CO2tocarbon*tonnes,\"-\")","v":0},{"$f":"IFERROR(E121*CO2tocarbon*tonnes,\"-\")","v":0},0]
["Fuel Consumption (MMBtu/year)",{"$f":"IFERROR((deheatrate/1000)*B85,\"-\")","v":0},{"$f":"IFERROR((deheatrate/1000)*B86,\"-\")","v":0},{"$f":"IFERROR((deheatrate/1000)*B87,\"-\")","v":0},{"$f":"IFERROR((deheatrate/1000)*B88,\"-\")","v":0},0]
[]
["The results of this analysis have not been reviewed or endorsed by the EPA CHP Partnership."]
["     Total Emissions for Conventional Production",null,null,null,"Total Emissions for CHP System"]
[{"$f":"CONCATENATE(\"                            \",TEXT(ROUND(E107+F119,2),\"#,###.##\"),\" tons of NOx\")","v":"                            . tons of NOx"},null,null,null,{"$f":"CONCATENATE(\"  \",TEXT(ROUND(E95,2),\"#,###.##\"),\" tons of NOx\")","v":"  . tons of NOx"}]
[{"$f":"CONCATENATE(\"                            \",TEXT(ROUND(E108+F120,2),\"#,###.##\"),\" tons of SO2\")","v":"                            . tons of SO2"},null,null,null,{"$f":"IFERROR(CONCATENATE(\"  \",TEXT(ROUND(E96,2),\"#,###.##\"),\" tons of SO2\"),\"\")","v":""}]
[{"$f":"CONCATENATE(\"                         \",TEXT(ROUND(E112+F124,0),\"#,###\"),\" tons of CO2e\")","v":"                          tons of CO2e"},null,null,null,{"$f":"IFERROR(CONCATENATE(TEXT(ROUND(E100,0),\"#,###\"),\" tons of CO2e\"),\"\")","v":""}]
[]
[]
[null,{"$f":"IFERROR(CONCATENATE(TEXT(ROUND(B85,0),\"#,###\"),\"  MWh\"),\"\")","v":"  MWh"}]
[{"$f":"CONCATENATE(TEXT(ROUND(F126,0),\"#,###\"),\" MMBtu\")","v":" MMBtu"},"  Electricity to Facility",null,{"$f":"IFERROR(CONCATENATE(TEXT(ROUND(E102,0),\"#,###\"),\" MMBtu\"),\"\")","v":" MMBtu"}]
["Fuel consumption",null,null,{"$f":"CONCATENATE(\"Fuel Consumption\")","v":"Fuel Consumption"},null,null,{"$f":"IFERROR(CONCATENATE(TEXT(ROUND(B68,0),\"#,###\"),\" MWh\"),\"\")","v":" MWh"}]
["Central Station                  ",{"$f":"IF(B86>0,CONCATENATE(TEXT(ROUND(B86,0),\"#,###\"),\" MWh\"),\"  No Cooling\")","v":"  No Cooling"},null,null,"CHP     ",null,"Electricity"]
["Power Plant                       ",{"$f":"IF(B86>0,\"Electricity to Chiller\",\" \")","v":" "},null,null,"System  ",null,"to Facility"]
[]
[null,{"$f":"IFERROR(CONCATENATE(TEXT(ROUND(B88,0),\"#,###\"),\" MWh\"),\"\")","v":" MWh"}]
[null,"Transmission Losses"]
[{"$f":"IF(AND(OR(chpsulfurinput2=0,ISBLANK(chpsulfurinput)),OR(chpnoxinput1=0,ISBLANK(chpnoxinput1)),OR(chpnoxinput2=0,ISBLANK(chpnoxinput2)),OR(chpnoxinput3=0,ISBLANK(chpnoxinput3)),OR(chpnoxinput4=0,ISBLANK(chpnoxinput4)),OR(stmsulfurinput2=0,ISBLANK(stmsulfurinput2)),OR(stmnoxinput=0,ISBLANK(stmnoxinput))),\"                           Power Plant Emissions\",CONCATENATE(\"                            \",TEXT(ROUND(F119,2),\"#,###.##\"),\" tons of NOx\"))","v":"                           Power Plant Emissions"},null,null,{"$f":"IF(AND(OR(chpsulfurinput2=0,ISBLANK(chpsulfurinput)),OR(chpnoxinput1=0,ISBLANK(chpnoxinput1)),OR(chpnoxinput2=0,ISBLANK(chpnoxinput2)),OR(chpnoxinput3=0,ISBLANK(chpnoxinput3)),OR(chpnoxinput4=0,ISBLANK(chpnoxinput4)),OR(stmsulfurinput2=0,ISBLANK(stmsulfurinput2)),OR(stmnoxinput=0,ISBLANK(stmnoxinput))),\"                        Power Plant Emissions\",CONCATENATE(\"  \",TEXT(ROUND(E95,2),\"                              #,###.##\"),\" tons of NOx\"))","v":"                        Power Plant Emissions"},null,"       Thermal Energy from CHP"]
[{"$f":"IF(AND(OR(chpsulfurinput2=0,ISBLANK(chpsulfurinput)),OR(chpnoxinput1=0,ISBLANK(chpnoxinput1)),OR(chpnoxinput2=0,ISBLANK(chpnoxinput2)),OR(chpnoxinput3=0,ISBLANK(chpnoxinput3)),OR(chpnoxinput4=0,ISBLANK(chpnoxinput4)),OR(stmsulfurinput2=0,ISBLANK(stmsulfurinput2)),OR(stmnoxinput=0,ISBLANK(stmnoxinput))),\" \",CONCATENATE(\"                            \",TEXT(ROUND(F120,2),\"#,###.##\"),\" tons of SO2\"))","v":" "},null,null,null,{"$f":"IF(AND(OR(chpsulfurinput2=0,ISBLANK(chpsulfurinput)),OR(chpnoxinput1=0,ISBLANK(chpnoxinput1)),OR(chpnoxinput2=0,ISBLANK(chpnoxinput2)),OR(chpnoxinput3=0,ISBLANK(chpnoxinput3)),OR(chpnoxinput4=0,ISBLANK(chpnoxinput4)),OR(stmsulfurinput2=0,ISBLANK(stmsulfurinput2)),OR(stmnoxinput=0,ISBLANK(stmnoxinput))),\" \",IFERROR(CONCATENATE(\"   \",TEXT(ROUND(E96,2),\"#,###.##\"),\" tons of SO2\"),\"\"))","v":" "}]
[{"$f":"IF(AND(OR(chpsulfurinput2=0,ISBLANK(chpsulfurinput)),OR(chpnoxinput1=0,ISBLANK(chpnoxinput1)),OR(chpnoxinput2=0,ISBLANK(chpnoxinput2)),OR(chpnoxinput3=0,ISBLANK(chpnoxinput3)),OR(chpnoxinput4=0,ISBLANK(chpnoxinput4)),OR(stmsulfurinput2=0,ISBLANK(stmsulfurinput2)),OR(stmnoxinput=0,ISBLANK(stmnoxinput))),\" \",CONCATENATE(\"                         \",TEXT(ROUND(F124,0),\"#,###\"),\" tons of CO2e\"))","v":" "},null,null,null,{"$f":"IF(AND(OR(chpsulfurinput2=0,ISBLANK(chpsulfurinput)),OR(chpnoxinput1=0,ISBLANK(chpnoxinput1)),OR(chpnoxinput2=0,ISBLANK(chpnoxinput2)),OR(chpnoxinput3=0,ISBLANK(chpnoxinput3)),OR(chpnoxinput4=0,ISBLANK(chpnoxinput4)),OR(stmsulfurinput2=0,ISBLANK(stmsulfurinput2)),OR(stmnoxinput=0,ISBLANK(stmnoxinput))),\" \",IFERROR(CONCATENATE(\"   \",TEXT(ROUND(E100,0),\"#,###\"),\" tons of CO2e\"),\"\"))","v":" "}]
[]
[null,null,null,null,null,null,{"$f":"IFERROR(IF(B69>0,CONCATENATE(TEXT(ROUND(B69,0),\"#,###\"),\" MMBtu \"),\"No              \"),\"\")","v":"No              "}]
[{"$f":"IFERROR(IF(E114>0,CONCATENATE(TEXT(ROUND(E114,0),\"#,###\"),\" MMBtu\"),\" \"),\"\")","v":" "},null,null,null,null,null,{"$f":"IF(B69>0,\"Thermal to\",\"Thermal\")","v":"Thermal"}]
[{"$f":"IF(E114>0,\"Fuel consumption\",\" \")","v":" "},null,null,null,null,null,{"$f":"IF(B69>0,\"Facility\",\"Applications\")","v":"Applications"}]
["On-Site Thermal                ",{"$f":"IFERROR(IF(B69>0,CONCATENATE(TEXT(ROUND(B69,0),\"#,###\"),\" MMBtu\"),\"No\"),\"\")","v":"No"}]
["Production                        ",{"$f":"IF(B69>0,\"Thermal to Facility\",\"Thermal Applications\")","v":"Thermal Applications"},null,null,"Absorption"]
[null,null,null,null,"Chiller    ",null,{"$f":"IF(B76<>\" \",CONCATENATE(TEXT(ROUND(B76,0),\"#,###\"),\" tons \"),\"No Cooling\")","v":"No Cooling"}]
[null,null,null,null,null,null,{"$f":"IF(B76<>\" \",\"of Cooling\",\" \")","v":" "}]
[null,null,null,null,null,null,{"$f":"IF(B76<>\" \",\"to Facility\",\" \")","v":" "}]
[{"$f":"IF(AND(OR(chpsulfurinput2=0,ISBLANK(chpsulfurinput)),OR(chpnoxinput1=0,ISBLANK(chpnoxinput1)),OR(chpnoxinput2=0,ISBLANK(chpnoxinput2)),OR(chpnoxinput3=0,ISBLANK(chpnoxinput3)),OR(chpnoxinput4=0,ISBLANK(chpnoxinput4)),OR(stmsulfurinput2=0,ISBLANK(stmsulfurinput2)),OR(stmnoxinput=0,ISBLANK(stmnoxinput))),\"                           On-Site Thermal Emissions\",CONCATENATE(\"                            \",TEXT(ROUND(E107,2),\"#,###.##\"),\" tons of NOx\"))","v":"                           On-Site Thermal Emissions"}]
[{"$f":"IF(AND(OR(chpsulfurinput2=0,ISBLANK(chpsulfurinput)),OR(chpnoxinput1=0,ISBLANK(chpnoxinput1)),OR(chpnoxinput2=0,ISBLANK(chpnoxinput2)),OR(chpnoxinput3=0,ISBLANK(chpnoxinput3)),OR(chpnoxinput4=0,ISBLANK(chpnoxinput4)),OR(stmsulfurinput2=0,ISBLANK(stmsulfurinput2)),OR(stmnoxinput=0,ISBLANK(stmnoxinput))),\" \",CONCATENATE(\"                            \",TEXT(ROUND(E108,2),\"#,###.##\"),\" tons of SO2\"))","v":" "}]
[{"$f":"IF(AND(OR(chpsulfurinput2=0,ISBLANK(chpsulfurinput)),OR(chpnoxinput1=0,ISBLANK(chpnoxinput1)),OR(chpnoxinput2=0,ISBLANK(chpnoxinput2)),OR(chpnoxinput3=0,ISBLANK(chpnoxinput3)),OR(chpnoxinput4=0,ISBLANK(chpnoxinput4)),OR(stmsulfurinput2=0,ISBLANK(stmsulfurinput2)),OR(stmnoxinput=0,ISBLANK(stmnoxinput))),\" \",CONCATENATE(\"                         \",TEXT(ROUND(E112,0),\"#,###\"),\" tons of CO2e\"))","v":" "}]
[]
[]
[]
["Table 9"]
["Emission Rates"]
[null,"CHP System including Duct Burners",{"$f":"IFERROR(CONCATENATE(CHPname,\" Alone\"),\"\")","v":""},"Displaced Electricity"]
["NOx (lb/MWh)",{"$f":"IFERROR(E95*2000/B$68,\"-\")","v":"-"},{"$f":"IFERROR(B95*2000/B$68,\"-\")","v":"-"},{"$f":"IFERROR(denoxrate,\"-\")","v":1.3268}]
["SO2 (lb/MWh)",{"$f":"IFERROR(E96*2000/B$68,\"-\")","v":"-"},{"$f":"IFERROR(B96*2000/B$68,\"-\")","v":"-"},{"$f":"IFERROR(deso2rate,\"-\")","v":2.5741000000000001}]
["CO2 (lb/MWh)",{"$f":"IFERROR(E97*2000/B$68,\"-\")","v":"-"},{"$f":"IFERROR(B97*2000/B$68,\"-\")","v":"-"},{"$f":"IFERROR(deco2rate,\"-\")","v":1640.1344999999999}]
[]
["Table 10"]
["Emission Rates"]
[null,"Displaced Thermal Production"]
["NOx (lb/MMBtu)",{"$f":"IFERROR(IF(dsbtu>0,dsnoxtons*2000/dsbtu,0),\"-\")","v":0}]
["SO2 (lb/MMBtu)",{"$f":"IFERROR(IF(dsbtu>0,dsso2tons*2000/dsbtu,0),\"-\")","v":0}]
["CO2 (lb/MMBtu)",{"$f":"IFERROR(IF(dsbtu>0,dsco2tons*2000/dsbtu,0),\"-\")","v":0}]

{"sheet":"SubThermalCalculator","index":3,"n_rows":26,"n_cols":4,"rows_kept":26,"cut":false,"hidden":false,"merged":[[8,1,9,1],[13,1,14,1]]}
["Thermal Calculator"]
[]
[null,"Value","Units","Description"]
[]
[]
[null,"Calculate the Power to Heat Ratio by completing the "]
[null," entries in one of the following boxes:"]
[null,0,"MMBtu/hr","Thermal output from a single unit"]
[null,"OR"]
[]
[null,0,"lb/hr","Steam consumed in process"]
[null,1000,"Btu/lb","Enthalpy (a common value is 1,000 Btu/lb)"]
[null,{"$f":"B11*B12/1000000","v":0},"MMBtu/hr","calculated"]
[null,"OR"]
[]
[null,0,"MMBtu/hr","Fuel consumed in thermal process (often a boiler)"]
[null,0,null,"Efficiency of thermal converter"]
[null,{"$f":"B16*B17","v":0},"MMBtu/hr","calculated"]
[]
[]
[]
[null,"Results"]
[null,{"$f":"IF(B8>0,B8,IF(B13>0,B13,IF(B18>0,B18,0)))","v":0},"MMBtu/hr","thermal output"]
[null,{"$f":"calcbtu*293","v":0},"kW","thermal output"]
[null,{"$f":"IF(chpcapinput>0,chpcapinput,\" \")","v":" "},{"$f":"IF(chpcapinput>0,\"kW\",\" \")","v":" "},{"$f":"IF(chpcapinput>0,\"kW capacity of CHP system\",\" \")","v":" "}]
[null,{"$f":"IF(calckw>0,B25/calckw,\" \")","v":" "},{"$f":"IF(chpcapinput>0,\" \",\" \")","v":" "},{"$f":"IF(chpcapinput>0,\"Power to Heat ratio of CHP system\",\" \")","v":" "}]

{"sheet":"SubGenSources","index":4,"n_rows":25,"n_cols":7,"rows_kept":25,"cut":false,"hidden":false,"merged":[]}
["Generation Sources"]
[]
[]
["Existing Generation Sources",null,null,null,null,"Heat Rate"]
["Name","Code","NOx lb/MWh","SO2 lb/MWh","CO2 lb/MWh","Btu/kWh"]
[{"$f":"LOOKUP(B6,Profiles!$B$11:$B$26,Profiles!$A$11:$A$26)","v":"EGrid Annual Average"},1,{"$f":"LOOKUP(B6,Profiles!B$11:B$26,Profiles!H$11:H$26)","v":0.94607755969518759},{"$f":"LOOKUP(B6,Profiles!B$11:B$26,Profiles!I$11:I$26)","v":1.8872353964120905},{"$f":"LOOKUP(B6,Profiles!B$11:B$26,Profiles!J$11:J$26)","v":1136.5291326364011},{"$f":"LOOKUP(B6,Profiles!B$11:B$26,Profiles!C$11:C$26)","v":6629.5773155103261},"EPA eGRID 2012 (released Oct. 2015), http://www.epa.gov/energy/egrid"]
[{"$f":"LOOKUP(B7,Profiles!$B$11:$B$26,Profiles!$A$11:$A$26)","v":"EGrid Annual Fossil"},2,{"$f":"LOOKUP(B7,Profiles!B$11:B$26,Profiles!H$11:H$26)","v":1.3268},{"$f":"LOOKUP(B7,Profiles!B$11:B$26,Profiles!I$11:I$26)","v":2.5741000000000001},{"$f":"LOOKUP(B7,Profiles!B$11:B$26,Profiles!J$11:J$26)","v":1640.1344999999999},{"$f":"LOOKUP(B7,Profiles!B$11:B$26,Profiles!C$11:C$26)","v":9447.7084265316407},"EPA eGRID 2012 (released Oct. 2015), http://www.epa.gov/energy/egrid"]
[{"$f":"LOOKUP(B8,Profiles!$B$11:$B$26,Profiles!$A$11:$A$26)","v":"EGrid Annual Coal"},4,{"$f":"LOOKUP(B8,Profiles!B$11:B$26,Profiles!H$11:H$26)","v":2.0270000000000001},{"$f":"LOOKUP(B8,Profiles!B$11:B$26,Profiles!I$11:I$26)","v":4.4062999999999999},{"$f":"LOOKUP(B8,Profiles!B$11:B$26,Profiles!J$11:J$26)","v":2173.9845285900478},{"$f":"LOOKUP(B8,Profiles!B$11:B$26,Profiles!C$11:C$26)","v":10486.160808514376},"EPA eGRID 2012 (released Oct. 2015), http://www.epa.gov/energy/egrid"]
[{"$f":"LOOKUP(B9,Profiles!$B$11:$B$26,Profiles!$A$11:$A$26)","v":"EGrid Annual Oil"},5,{"$f":"LOOKUP(B9,Profiles!B$11:B$26,Profiles!H$11:H$26)","v":3.3875000000000002},{"$f":"LOOKUP(B9,Profiles!B$11:B$26,Profiles!I$11:I$26)","v":13.383599999999999},{"$f":"LOOKUP(B9,Profiles!B$11:B$26,Profiles!J$11:J$26)","v":1904.3003000000001},{"$f":"LOOKUP(B9,Profiles!B$11:B$26,Profiles!C$11:C$26)","v":10754.153967973516},"EPA eGRID 2012 (released Oct. 2015), http://www.epa.gov/energy/egrid"]
[{"$f":"LOOKUP(B10,Profiles!$B$11:$B$26,Profiles!$A$11:$A$26)","v":"EGrid Annual Natural Gas"},6,{"$f":"LOOKUP(B10,Profiles!B$11:B$26,Profiles!H$11:H$26)","v":0.39729999999999999},{"$f":"LOOKUP(B10,Profiles!B$11:B$26,Profiles!I$11:I$26)","v":8.4400000000000003E-2},{"$f":"LOOKUP(B10,Profiles!B$11:B$26,Profiles!J$11:J$26)","v":940.72305641832907},{"$f":"LOOKUP(B10,Profiles!B$11:B$26,Profiles!C$11:C$26)","v":7876.1718228561549},"EPA eGRID 2012 (released Oct. 2015), http://www.epa.gov/energy/egrid"]
[{"$f":"LOOKUP(B11,Profiles!$B$11:$B$26,Profiles!$A$11:$A$26)","v":"Coal Boiler 3.8 lb/MWh NOx"},7,{"$f":"LOOKUP(B11,Profiles!B$11:B$26,Profiles!H$11:H$26)","v":3.8},{"$f":"LOOKUP(B11,Profiles!B$11:B$26,Profiles!I$11:I$26)","v":5},{"$f":"LOOKUP(B11,Profiles!B$11:B$26,Profiles!J$11:J$26)","v":1967.45},{"$f":"LOOKUP(B11,Profiles!B$11:B$26,Profiles!C$11:C$26)","v":9500},"AP 42, Fifth Edition, Compilation of Air Pollutant Emission Factors, Volume 1: Stationary Point and Area Sources.  http://www3.epa.gov/ttnchie1/ap42/ "]
[{"$f":"LOOKUP(B12,Profiles!$B$11:$B$26,Profiles!$A$11:$A$26)","v":"Coal Boiler 1.5 lb/MWh NOx"},8,{"$f":"LOOKUP(B12,Profiles!B$11:B$26,Profiles!H$11:H$26)","v":1.5},{"$f":"LOOKUP(B12,Profiles!B$11:B$26,Profiles!I$11:I$26)","v":2.5},{"$f":"LOOKUP(B12,Profiles!B$11:B$26,Profiles!J$11:J$26)","v":1967.45},{"$f":"LOOKUP(B12,Profiles!B$11:B$26,Profiles!C$11:C$26)","v":9500},"AP 42, Fifth Edition, Compilation of Air Pollutant Emission Factors, Volume 1: Stationary Point and Area Sources.  http://www3.epa.gov/ttnchie1/ap42/ "]
[{"$f":"LOOKUP(B13,Profiles!$B$11:$B$26,Profiles!$A$11:$A$26)","v":"Coal Boiler with SCR 0.8 lb/MWh NOx"},9,{"$f":"LOOKUP(B13,Profiles!B$11:B$26,Profiles!H$11:H$26)","v":0.8},{"$f":"LOOKUP(B13,Profiles!B$11:B$26,Profiles!I$11:I$26)","v":1},{"$f":"LOOKUP(B13,Profiles!B$11:B$26,Profiles!J$11:J$26)","v":1967.45},{"$f":"LOOKUP(B13,Profiles!B$11:B$26,Profiles!C$11:C$26)","v":9500},"AP 42, Fifth Edition, Compilation of Air Pollutant Emission Factors, Volume 1: Stationary Point and Area Sources.  http://www3.epa.gov/ttnchie1/ap42/ "]
[{"$f":"LOOKUP(B14,Profiles!$B$11:$B$26,Profiles!$A$11:$A$26)","v":"Gas Boiler 0.77 lb/MWh NOx"},10,{"$f":"LOOKUP(B14,Profiles!B$11:B$26,Profiles!H$11:H$26)","v":0.77},{"$f":"LOOKUP(B14,Profiles!B$11:B$26,Profiles!I$11:I$26)","v":6.2368932038834946E-3},{"$f":"LOOKUP(B14,Profiles!B$11:B$26,Profiles!J$11:J$26)","v":1285.9000000000001},{"$f":"LOOKUP(B14,Profiles!B$11:B$26,Profiles!C$11:C$26)","v":11000},"AP 42, Fifth Edition, Compilation of Air Pollutant Emission Factors, Volume 1: Stationary Point and Area Sources.  http://www3.epa.gov/ttnchie1/ap42/ "]
[{"$f":"LOOKUP(B15,Profiles!$B$11:$B$26,Profiles!$A$11:$A$26)","v":"Gas Turbine Peaker 25 ppm"},11,{"$f":"LOOKUP(B15,Profiles!B$11:B$26,Profiles!H$11:H$26)","v":1.1029411764705883},{"$f":"LOOKUP(B15,Profiles!B$11:B$26,Profiles!I$11:I$26)","v":6.8038834951456312E-3},{"$f":"LOOKUP(B15,Profiles!B$11:B$26,Profiles!J$11:J$26)","v":1402.8},{"$f":"LOOKUP(B15,Profiles!B$11:B$26,Profiles!C$11:C$26)","v":12000},"AP 42, Fifth Edition, Compilation of Air Pollutant Emission Factors, Volume 1: Stationary Point and Area Sources.  http://www3.epa.gov/ttnchie1/ap42/ "]
[{"$f":"LOOKUP(B16,Profiles!$B$11:$B$26,Profiles!$A$11:$A$26)","v":"Gas combined-cycle 9 ppm"},12,{"$f":"LOOKUP(B16,Profiles!B$11:B$26,Profiles!H$11:H$26)","v":0.26470588235294118},{"$f":"LOOKUP(B16,Profiles!B$11:B$26,Profiles!I$11:I$26)","v":4.5359223300970872E-3},{"$f":"LOOKUP(B16,Profiles!B$11:B$26,Profiles!J$11:J$26)","v":935.2},{"$f":"LOOKUP(B16,Profiles!B$11:B$26,Profiles!C$11:C$26)","v":8000},"AP 42, Fifth Edition, Compilation of Air Pollutant Emission Factors, Volume 1: Stationary Point and Area Sources.  http://www3.epa.gov/ttnchie1/ap42/ "]
[{"$f":"LOOKUP(B17,Profiles!$B$11:$B$26,Profiles!$A$11:$A$26)","v":"Gas combined-cycle 3 ppm"},13,{"$f":"LOOKUP(B17,Profiles!B$11:B$26,Profiles!H$11:H$26)","v":7.720588235294118E-2},{"$f":"LOOKUP(B17,Profiles!B$11:B$26,Profiles!I$11:I$26)","v":3.9689320388349514E-3},{"$f":"LOOKUP(B17,Profiles!B$11:B$26,Profiles!J$11:J$26)","v":818.3},{"$f":"LOOKUP(B17,Profiles!B$11:B$26,Profiles!C$11:C$26)","v":7000},"AP 42, Fifth Edition, Compilation of Air Pollutant Emission Factors, Volume 1: Stationary Point and Area Sources.  http://www3.epa.gov/ttnchie1/ap42/ "]
[]
[]
["Please enter emission rates for the new generation sources:"]
["User Defined Generation Sources",null,null,null,null,"Heat Rate"]
["Name","Code","NOx lb/MWh","SO2 lb/MWh","CO2 lb/MWh","Btu/kWh"]
["User Source 1",14,0,0,0,0]
["User Source 2",15,0,0,0,0]
["User Source 3",16,0,0,0,0]

{"sheet":"Biomass and Coal Data","index":5,"n_rows":37,"n_cols":9,"rows_kept":37,"cut":false,"hidden":false,"merged":[[10,7,11,8],[24,1,25,2],[24,3,25,4],[2,1,2,6],[10,3,11,4],[10,1,11,2],[10,5,11,6]]}
["Biomass  "]
["Heat Content of Solid Biomass Fuels (Btu/lb delivered)"]
[null,"Moisture Content of Biomass"]
["Biomass Fuel Source","Bone Dry",0.1,0.2,0.3,0.4,0.5]
["Wood and Wood Residuals",7690,7004,6318,5632,4946,4260]
["Agricultural Byproducts",4125,3851,3577,3303,3029,2755]
["Peat",4000,3726,3452,3178,2904,2630]
["Solid Byproducts",12915,12095,11275,10455,9635,8815]
[]
["Emission Rates"]
[null,"Heat Content (HHV)",null,"CO2 Emission Rate",null,"NOx Emission Rate",null,"Sulfur Content"]
["Biomass Fuel Source"]
["Wood and Wood Residuals",7690,"Btu/lb",206.7,"lb/MMBtu",0.16500000000000001,"lb/MMBtu",8.2500000000000004E-3,"lb/MMBtu"]
["Agricultural Byproducts",4125,"Btu/lb",260.39999999999998,"lb/MMBtu",0.16500000000000001,"lb/MMBtu",8.2500000000000004E-3,"lb/MMBtu"]
["Peat",4000,"Btu/lb",246.5,"lb/MMBtu",0.16500000000000001,"lb/MMBtu",8.2500000000000004E-3,"lb/MMBtu"]
["Solid Byproducts",12915,"Btu/lb",232.5,"lb/MMBtu",0.16500000000000001,"lb/MMBtu",8.2500000000000004E-3,"lb/MMBtu"]
["Biogas",841,"Btu/scf",114.7,"lb/MMBtu"]
["Biodiesel",128000,"Btu/gal",162.69999999999999,"lb/MMBtu"]
["Ethanol",84000,"Btu/gal",150.80000000000001,"lb/MMBtu"]
["*CO2 Emissions data from EPA Mandatory GHG Reporting Rule, 40 CFR 98, Subpart C, Table C-1 "]
["*NOX and Sulfur Emissions Data from AP-42"]
["The EPA has not made a final determination on how to evaluate emissions from biomass fuels; in the interim, the Calculator is using the CO2 emissions factors from 40 CFR 98, Table C-1."]
[]
["Coal"]
[null,"CO2 Emission Rate",null,"Heat Content (HHV)"]
["Coal Type"]
["Anthracite",228.3,"lb/MMBtu",12545,"Btu/lb"]
["Bituminous",205.9,"lb/MMBtu",12465,"Btu/lb"]
["Sub-bituminous",213.9,"lb/MMBtu",8625,"Btu/lb"]
["Lignite",212.5,"lb/MMBtu",7105,"Btu/lb"]
["Industrial Mixed Use",207.1,"lb/MMBtu",11175,"Btu/lb"]
["Commercial Mixed Use",210,"lb/MMBtu",10695,"Btu/lb"]
["*Emissions Data from EPA Mandatory GHG Reporting Rule, Part 98, Subpart C, Table C-1"]
[]
[]
["For an expanded list of emissions factors and heat content values, please see Table C-1 in 40 CFR 98:"]
["http://www.ecfr.gov/cgi-bin/text-idx?tpl=/ecfrbrowse/Title40/40cfr98_main_02.tpl"]

{"sheet":"Displaced Generation Profiles","index":6,"n_rows":127,"n_cols":1,"rows_kept":127,"cut":false,"hidden":false,"merged":[[1,0,1,11],[126,0,127,10]]}
[]
["Selecting an Appropriate Displaced Electricity Generation Profile"]
[]
[]
[]
[]
[]
[]
[]
[]
[]
[]
[]
[]
[]
[]
[]
[]
[]
[]
[]
[]
[]
[]
[]
[]
[]
[]
[]
[]
[]
[]
[]
[]
[]
[]
[]
[]
[]
[]
[]
[]
[]
[]
[]
[]
[]
[]
[]
[]
[]
[]
[]
[]
[]
[]
[]
[]
[]
[]
[]
[]
[]
[]
[]
[]
[]
[]
[]
[]
[]
[]
[]
[]
[]
[]
[]
[]
[]
[]
[]
[]
[]
[]
[]
[]
[]
[]
[]
[]
[]
[]
[]
[]
[]
[]
[]
[]
[]
[]
[]
[]
[]
[]
[]
[]
[]
[]
[]
[]
[]
[]
[]
[]
[]
[]
[]
[]
[]
[]
[]
[]
[]
[]
[]
[]
["More details on eGRID generation sources and displaced grid electricity can be found in Appendix B of EPA's Fuel and CO2 Emissions Savings Calculation Methodology for CHP"]

{"sheet":"Maps","index":7,"n_rows":0,"n_cols":0,"rows_kept":0,"cut":false,"hidden":false,"merged":[]}

{"sheet":"Lists","index":8,"n_rows":219,"n_cols":7,"rows_kept":219,"cut":false,"hidden":true,"merged":[]}
["CHP Pick list lookups"]
[]
["A1","CHP technology"]
[1,"Recip Engine - Rich Burn","Recip Engine - Rich Burn"]
[2,"Recip Engine - Lean Burn","Recip Engine - Lean Burn"]
[3,"Recip Engine - Diesel","Recip Engine - Diesel"]
[4,"Microturbine","Microturbine"]
[5,"Combustion Turbine","Combustion Turbine"]
[6,"Boiler / Steam Turbine","Boiler / Steam Turbine"]
[7,"Fuel Cell","Fuel Cell"]
[8,"Other","Other"]
[9,"Waste Heat to Power (Power Only)","Waste Heat to Power"]
[10,"Waste Heat to Power (Power and Thermal)","Waste Heat to Power"]
[]
[]
[]
["B3","Operating profile of CHP","Hours"]
[1,"5 days per week, 8 hours per day - 2,080 hours",{"$f":"52*5*8","v":2080}]
[2,"5 days per week, 16 hours per day - 4,160 hours",{"$f":"52*5*16","v":4160}]
[3,"7 days per week - 16 hours per day - 5,840 hours",5840]
[4,"7 days per week, 24 hours per day, 8,760 hours",8760]
[5,"I will enter a value"]
[]
["B5","Profile of Displaced Electricity"]
[1,"eGRID All Sources (2012 data)","E",1,"Egrid State Average"]
[2,"eGRID Fossil Fuel (2012 data)","E",2,"Egrid State Average"]
[3,"eGRID Non-Baseload (2012 data)",null,null,"Egrid State Average"]
[4,"eGRID Coal (2012 data)","E",3,"Egrid State Average"]
[5,"eGRID Oil (2012 data)","E",4,"Egrid State Average"]
[6,"eGRID Gas (2012 data)","E",5,"Egrid State Average"]
[7,"Coal Boiler 3.8 lb/MWh NOx","D",1,"Defined"]
[8,"Coal Boiler 1.5 lb/MWh NOx","D",2,"Defined"]
[9,"Coal Boiler with SCR 0.8 lb/MWh NOx","D",3,"Defined"]
[10,"Gas Boiler 0.77 lb/MWh NOx","D",4,"Defined"]
[11,"Gas Turbine Peaker 25 ppm","D",5,"Defined"]
[12,"Gas combined-cycle 9 ppm","D",6,"Defined"]
[13,"Gas combined-cycle 3 ppm","D",7,"Defined"]
[14,"User Source 1","U",1,"User Profile"]
[15,"User Source 2","U",2,"User Profile"]
[16,"User Source 3","U",3,"User Profile"]
[]
["B8","Egrid profile"]
[1,"eGRID State Averages All Sources (2012 data)"]
[2,"eGRID State Average Fossil (2012 data)"]
[3,"eGRID State Averages Coal (2012 data)"]
[4,"eGRID State Averages Oil (2012 data)"]
[5,"eGRID State Averages Gas (2012 data)"]
[]
["D2","Displaced Thermal Source","CO2 rate",null,null,"Heat Content"]
[1,"Existing Gas Boiler",{"$f":"co2gas","v":116.9},null,null,1028,"Btu/cf"]
[2,"Existing Distillate Oil Boiler",{"$f":"co2oil","v":163.1},null,null,138000,"Btu/gal"]
[3,"Existing Residual Oil Boiler",{"$f":"co2oil","v":163.1},null,null,150000,"Btu/gal"]
[4,"Existing Coal Boiler",{"$f":"co2coal","v":207.1},null,null,{"$f":"heatcontentcoal","v":11175},"Btu/lb"]
[5,"New Gas Boiler",{"$f":"co2gas","v":116.9},null,null,1028,"Btu/cf"]
[6,"New Distillate Oil Boiler",{"$f":"co2oil","v":163.1},null,null,138000,"Btu/gal"]
[7,"New Residual Oil Boiler",{"$f":"co2oil","v":163.1},null,null,150000,"Btu/gal"]
[8,"New Coal Boiler",{"$f":"co2coal","v":207.1},null,null,{"$f":"heatcontentcoal","v":11175},"Btu/lb"]
[9,"Electric Resistence or Heat Pump",0,null,null,0]
[10,"Existing Propane Boiler",139,null,null,91600,"Btu/gal"]
[11,"New Propane Boiler",139,null,null,91600,"Btu/gal"]
[12,"Other",0,null,null,138000,"Btu/gal"]
[]
[]
["B6","State","Region","Grid Loss %"]
[1,"US Average",1,{"$f":"VLOOKUP(C65,$A$213:$C$219,3)","v":8.3299999999999999E-2},null,{"$f":"VLOOKUP(deinput2,A65:D152,3)","v":1},{"$f":"VLOOKUP(deinput2,A65:D152,4)","v":8.3299999999999999E-2}]
[{"$f":"A65+1","v":2},"AKGD Alaska Grid",5,8.6599999999999996E-2]
[3,"AKMS Miscellaneous",5,8.6599999999999996E-2]
[4,"ERCOT All",4,7.0300000000000001E-2]
[5,"FRCC All",2,9.1700000000000004E-2]
[6,"HICC Miscellaneous",6,7.6899999999999996E-2]
[7,"HIOA Oahu",6,7.6899999999999996E-2]
[8,"MRO East",2,9.1700000000000004E-2]
[9,"MRO West",2,9.1700000000000004E-2]
[{"$f":"A73+1","v":10},"NYLI Long Island",2,9.1700000000000004E-2]
[11,"NYCW NYC/Westchester",2,9.1700000000000004E-2]
[12,"NEWE New England",2,9.1700000000000004E-2]
[13,"NYUP Upstate NY",2,9.1700000000000004E-2]
[14,"RFCE East",2,9.1700000000000004E-2]
[15,"RFCM Michigan",2,9.1700000000000004E-2]
[16,"RFCW West",2,9.1700000000000004E-2]
[{"$f":"A80+1","v":17},"SRMW Midwest",2,9.1700000000000004E-2]
[18,"SRMV Mississippi Valley",2,9.1700000000000004E-2]
[19,"SRSO South",2,9.1700000000000004E-2]
[20,"SRTV Tennessee Valley",2,9.1700000000000004E-2]
[21,"SRVC Virginia/Carolina",2,9.1700000000000004E-2]
[22,"SPNO North",2,9.1700000000000004E-2]
[23,"SPSO South",2,9.1700000000000004E-2]
[24,"CAMX California",3,5.7599999999999998E-2]
[25,"NWPP Northwest",3,5.7599999999999998E-2]
[26,"RMPA Rockies",3,5.7599999999999998E-2]
[27,"AZNM Southwest",3,5.7599999999999998E-2]
[28,"ASCC - Alaska Systems Coord. Cncl",5,8.6599999999999996E-2]
[29,"FRCC - Florida Reliability Coord. Cncl",2,9.1700000000000004E-2]
[30,"HICC - Hawaiian Islands Coord Cncl",6,7.6899999999999996E-2]
[31,"MRO - Midwest Reliability Org.",2,9.1700000000000004E-2]
[32,"NPCC - Northeast Power Coord Cncl",2,9.1700000000000004E-2]
[33,"RFC - Reliability First Corp",2,{"$f":"VLOOKUP(C97,$A$213:$C$219,3)","v":9.1700000000000004E-2}]
[34,"SERC - SERC Reliability Corp",2,9.1700000000000004E-2]
[35,"SPP - Southwest Power Pool",2,9.1700000000000004E-2]
[36,"TRE - Texas Regional Entity",4,7.0300000000000001E-2]
[37,"WECC - Western Elec Coord Cncl",3,5.7599999999999998E-2]
[38,"AK",5,8.6599999999999996E-2]
[39,"AL",2,9.1700000000000004E-2]
[40,"AR",2,9.1700000000000004E-2]
[41,"AZ",3,5.7599999999999998E-2]
[42,"CA",3,5.7599999999999998E-2]
[43,"CO",3,5.7599999999999998E-2]
[44,"CT",2,9.1700000000000004E-2]
[45,"DC",2,9.1700000000000004E-2]
[46,"DE",2,9.1700000000000004E-2]
[47,"FL",2,9.1700000000000004E-2]
[48,"GA",2,9.1700000000000004E-2]
[{"$f":"A112+1","v":49},"HI",6,7.6899999999999996E-2]
[50,"IA",2,9.1700000000000004E-2]
[51,"ID",3,5.7599999999999998E-2]
[52,"IL",2,9.1700000000000004E-2]
[53,"IN",2,9.1700000000000004E-2]
[54,"KS",2,9.1700000000000004E-2]
[55,"KY",2,9.1700000000000004E-2]
[56,"LA",2,9.1700000000000004E-2]
[57,"MA",2,9.1700000000000004E-2]
[58,"MD",2,9.1700000000000004E-2]
[59,"ME",2,9.1700000000000004E-2]
[60,"MI",2,9.1700000000000004E-2]
[61,"MN",2,9.1700000000000004E-2]
[62,"MO",2,9.1700000000000004E-2]
[63,"MS",2,9.1700000000000004E-2]
[64,"MT",3,5.7599999999999998E-2]
[65,"NC",2,{"$f":"VLOOKUP(C129,$A$213:$C$219,3)","v":9.1700000000000004E-2}]
[66,"ND",2,9.1700000000000004E-2]
[67,"NE",2,9.1700000000000004E-2]
[68,"NH",2,9.1700000000000004E-2]
[69,"NJ",2,9.1700000000000004E-2]
[70,"NM",3,5.7599999999999998E-2]
[71,"NV",3,5.7599999999999998E-2]
[72,"NY",2,9.1700000000000004E-2]
[73,"OH",2,9.1700000000000004E-2]
[74,"OK",2,9.1700000000000004E-2]
[75,"OR",3,5.7599999999999998E-2]
[76,"PA",2,9.1700000000000004E-2]
[77,"RI",2,9.1700000000000004E-2]
[78,"SC",2,9.1700000000000004E-2]
[79,"SD",2,9.1700000000000004E-2]
[80,"TN",2,9.1700000000000004E-2]
[{"$f":"A144+1","v":81},"TX",4,7.0300000000000001E-2]
[82,"UT",3,5.7599999999999998E-2]
[83,"VA",2,9.1700000000000004E-2]
[84,"VT",2,9.1700000000000004E-2]
[85,"WA",3,5.7599999999999998E-2]
[86,"WI",2,9.1700000000000004E-2]
[87,"WV",2,9.1700000000000004E-2]
[88,"WY",3,5.7599999999999998E-2]
[]
["A6","Fuel used in CHP system","CO2 rate",null,null,"Heat Content"]
[1,"Natural Gas",{"$f":"co2gas","v":116.9},null,null,1028,"Btu/cf"]
[2,"Diesel Fuel",{"$f":"co2oil","v":163.1},null,null,138000,"Btu/gal"]
[3,"Distillate Oil",{"$f":"co2oil","v":163.1},null,null,138000,"Btu/gal"]
[4,"Coal",{"$f":"co2coal","v":207.1},null,null,{"$f":"heatcontentcoal","v":11175},"Btu/lb"]
[5,"Propane",{"$f":"co2propane","v":139},null,null,91600,"Btu/gal"]
[6,"Woody Biomass",{"$f":"co2wood","v":206.7},null,null,{"$f":"heatcontentwood","v":7500},"Btu/lb"]
[7,"Other (including renewables)",0,null,null,138000,"Btu/gal"]
[8,"Waste Heat",0]
[]
[]
["A7","Fuel used in STM system","CO2 rate",null,null,"Heat Content"]
[1,"Natural Gas",{"$f":"co2gas","v":116.9},null,null,1028,"Btu/cf"]
[2,"Diesel Fuel",{"$f":"co2oil","v":163.1},null,null,138000,"Btu/gal"]
[3,"Distillate Oil",{"$f":"co2oil","v":163.1},null,null,138000,"Btu/gal"]
[4,"Coal",{"$f":"co2coal","v":207.1},null,null,{"$f":"heatcontentcoal","v":11175},"Btu/lb"]
[5,"Propane",{"$f":"co2propane","v":139},null,null,91600,"Btu/gal"]
[6,"Woody Biomass",{"$f":"co2wood","v":206.7},null,null,{"$f":"heatcontentwood","v":7500},"Btu/lb"]
[7,"Other",0,null,null,138000,"Btu/gal"]
[]
["A8","Does the System provide cooling"]
[1,"Yes"]
[2,"No"]
[]
["A9","CHP: What Cooling Technology Does this System Use?"]
[1,{"$f":"CONCATENATE(\"Typical \",E179,\", COP=\",D179)","v":{"$error":"#N/A"}},null,{"$f":"CHPTech!B230","v":{"$error":"#N/A"}},"Single-Effect Absorption Chiller"]
[2,{"$f":"CONCATENATE(\"Typical \",E180,\", COP=\",D180)","v":{"$error":"#N/A"}},null,{"$f":"CHPTech!B231","v":{"$error":"#N/A"}},"Double-Effect Absorption Chiller"]
[3,"I Will Enter a Value",null,null,"I Will Enter a Value"]
[]
["C4","Does the System have duct burners"]
[1,"Yes"]
[2,"No"]
[]
["H1","Does the System Provide Heating Cooling or Both?"]
[1,"Heating Only"]
[2,"Cooling Only"]
[3,"Heating and Cooling"]
[]
["H2","If Heating and Cooling: Does the System Provide Simultaneous Heating and Cooling?"]
[1,"Yes"]
[2,"No"]
[]
["H3","What is the Efficiency of the Cooling System that is Being Displaced?"]
[1,"1.60 kW/ton (COP=2.2) 1980-vintage, Roof-top unit <150 tons capacity"]
[2,"1.26 kW/ton (COP=2.8) Average new unit, Roof-top unit <150 tons capacity"]
[3,"1.00 kW/ton (COP=3.5) Best available, Roof-top unit <150 tons capacity"]
[4,"1.60 kW/ton (COP=2.2) 1980-vintage, reciprocating compressor, air-cooled, <150 tons capacity"]
[5,"1.26 kW/ton (COP=2.8) Average new unit, reciprocating compressor, air-cooled, <150 tons capacity"]
[6,"1.00 kW/ton (COP=3.5) Best available, reciprocating compressor, air-cooled, <150 tons capacity"]
[7,"1.26 kW/ton (COP=2.8) Average new unit, rotary screw compressor, air-cooled, <150 tons capacity"]
[8,"0.94 kW/ton (COP=3.75) Best available, rotary screw compressor, air-cooled, <150 tons capacity"]
[9,"1.03 kW/ton (COP=3.4) 1980-vintage centrifugal compressor, water-cooled, >=150 tons capacity"]
[10,"0.58 kW/ton (COP=6.1) Average new centrifugal compressor, water-cooled, >=150 tons capacity"]
[11,"0.45 kW/ton (COP=7.8) Best available centrifugal compressor, water-cooled, >=150 tons capacity"]
[12,"0.80 kW/ton (COP=4.4) Average new rotary screw compressor, water-cooled, >=150 tons capacity"]
[13,"0.56 kW/ton (COP=6.25) Best available rotary screw compressor, water-cooled, >=150 tons capacity"]
[14,"I Will Enter a Value"]
[]
["B7","US Interconnect Power Grid Region","T&D Loss %"]
[1,"US Average",8.3299999999999999E-2,null,"http://www2.epa.gov/sites/production/files/2015-10/documents/egrid2012_technicalsupportdocument.pdf"]
[2,"Eastern Interconnect",9.1700000000000004E-2]
[3,"Western Interconnect",5.7599999999999998E-2]
[4,"ERCOT",7.0300000000000001E-2]
[5,"Alaska",8.6599999999999996E-2]
[6,"Hawaii",7.6899999999999996E-2]
[7,"I will enter a value"]

{"sheet":"STMTech","index":9,"n_rows":32,"n_cols":11,"rows_kept":32,"cut":false,"hidden":true,"merged":[]}
["Displaced Thermal Calculation"]
[]
["Selected Thermal Source"]
[{"$f":"stminput1","v":0},{"$f":"LOOKUP($A4,$A7:$A23,B7:B23)","v":{"$error":"#N/A"}},{"$f":"LOOKUP($A4,$A7:$A23,C7:C23)","v":{"$error":"#N/A"}},{"$f":"LOOKUP($A4,$A7:$A23,D7:D23)","v":{"$error":"#N/A"}},{"$error":"#N/A"},{"$error":"#N/A"},{"$error":"#N/A"},null,{"$error":"#N/A"},{"$error":"#N/A"},{"$error":"#N/A"}]
[]
[null,"Fuel used in displaced boiler","Boiler Eff","NOx lb/MMBtu","Sulfur content","SO2 lb/MMBtu","CO2 lb/MMBtu",null,"Fuel MMBtu/ton","CH4 lb/MMBtu","N2O lb/MMBtu"]
[1,"Existing - Natural Gas",0.8,0.1,{"$f":"ngsulfur","v":7.0967437470559683E-7},{"$f":"E7*2*2000/I7","v":5.8513618677087924E-4},{"$f":"co2gas","v":116.9},null,{"$f":"2000*ngbtu/(ngdensity*1000000)","v":4.8513449740443608},2.2040000000000002E-3,2.2040000000000002E-4]
[2,"Existing - Distillate Oil",0.8,0.15,4.8700000000000002E-4,5.1086266390614227E-2,{"$f":"co2oil","v":163.1},null,{"$f":"Factors!$A$16*42*2000/(Factors!$A$17*1000000)","v":38.131578947368418},6.6120000000000007E-3,1.3224000000000001E-3]
[3,"Existing - Residual Oil",0.83,0.2,1.4610000000000001E-3,0.15352095238095237,{"$f":"co2oil","v":163.1},null,{"$f":"Factors!$A$19*42*2000/(Factors!$A$20*1000000)","v":38.066465256797585},6.6120000000000007E-3,1.3224000000000001E-3]
[4,"Existing - Coal",0.85,0.4,0.01,1.9034023316678563,{"$f":"co2coal","v":207.1},null,{"$f":"Factors!$A$55","v":21.015000000000001},2.4244000000000002E-2,3.5264000000000003E-3]
[5,"New - Natural Gas",0.8,0.05,{"$f":"ngsulfur","v":7.0967437470559683E-7},5.8513618677087924E-4,{"$f":"co2gas","v":116.9},null,{"$f":"2000*ngbtu/(ngdensity*1000000)","v":4.8513449740443608},2.2040000000000002E-3,2.2040000000000002E-4]
[6,"New - Distillate Oil",0.8,0.05,4.8700000000000002E-4,5.1086266390614227E-2,{"$f":"co2oil","v":163.1},null,{"$f":"Factors!$A$16*42*2000/(Factors!$A$17*1000000)","v":38.131578947368418},6.6120000000000007E-3,1.3224000000000001E-3]
[7,"New - Residual Oil",0.83,0.1,9.7400000000000004E-4,0.1023473015873016,{"$f":"co2oil","v":163.1},null,{"$f":"Factors!$A$19*42*2000/(Factors!$A$20*1000000)","v":38.066465256797585},6.6120000000000007E-3,1.3224000000000001E-3]
[8,"New - Coal",0.85,0.1,0.01,1.9034023316678563,{"$f":"co2coal","v":207.1},null,{"$f":"Factors!$A$55","v":21.015000000000001},2.4244000000000002E-2,3.5264000000000003E-3]
[9,"Electric Resistence or Heat Pump",1.2,0,0,0,0,null,0,0,0]
[10,"Existing - Propane",0.8,0.1,{"$f":"ngsulfur","v":7.0967437470559683E-7},5.8400000000045037E-4,{"$f":"co2propane","v":139},null,{"$f":"(Factors!A45/propDensity*2000)/1000000","v":43.61904761904762},2.2040000000000002E-3,2.2040000000000002E-4]
[11,"New - Propane",0.8,0.1,{"$f":"ngsulfur","v":7.0967437470559683E-7},5.8400000000045037E-4,{"$f":"co2propane","v":139},null,{"$f":"(Factors!A45/propDensity*2000)/1000000","v":43.61904761904762},2.2040000000000002E-3,2.2040000000000002E-4]
[12,"Other",0.8,{"$f":"stmnoxinput","v":0},{"$f":"stmsulfurinput1","v":0},0,160,null,{"$f":"Factors!$A$19*42*2000/(Factors!$A$20*1000000)","v":38.066465256797585},6.6120000000000007E-3,1.3224000000000001E-3]
[]
[]
[]
["Boiler Efficiency"]
[{"$f":"chpfuelinput","v":0},{"$f":"LOOKUP($A23,$A26:$A32,B26:B32)","v":{"$error":"#N/A"}},{"$error":"#N/A"},{"$error":"#N/A"},{"$error":"#N/A"},{"$error":"#N/A"},{"$error":"#N/A"},{"$error":"#N/A"},{"$error":"#N/A"}]
[]
[null,null,"Boiler Eff","NOx lb/MMBtu","Sulfur Content","SO2 lb/MMBtu","CO2 lb/MMBtu","CH4 lb/MMBtu","N2O lb/MMBtu"]
[1,"Natural Gas",0.8,0.1,9.9999999999999995E-7,5.8399999999999999E-4,{"$f":"co2gas","v":116.9},{"$f":"ch4gas","v":2.2040000000000002E-3},{"$f":"n2ogas","v":2.2040000000000002E-4}]
[2,"Diesel Fuel",0.8,0.15,4.8700000000000002E-4,0.05,{"$f":"co2oil","v":163.1},{"$f":"ch4oil","v":6.6120000000000007E-3},{"$f":"n2ooil","v":1.3224000000000001E-3}]
[3,"Distillate Oil",0.8,0.15,4.8700000000000002E-4,0.05,{"$f":"co2oil","v":163.1},{"$f":"ch4oil","v":6.6120000000000007E-3},{"$f":"n2ooil","v":1.3224000000000001E-3}]
[4,"Coal",0.85,0.1,0.01,1.9,{"$f":"co2coal","v":207.1},{"$f":"ch4coal","v":2.4244000000000002E-2},{"$f":"n2ocoal","v":3.5264000000000003E-3}]
[5,"Propane",0.8,0.1,9.9999999999999995E-7,5.8399999999999999E-4,{"$f":"co2gas","v":116.9},{"$f":"ch4gas","v":2.2040000000000002E-3},{"$f":"n2ogas","v":2.2040000000000002E-4}]
[6,"Woody Biomass",0.83,0.16500000000000001,1.0000000000000001E-5,8.2500000000000004E-3,{"$f":"co2wood","v":206.7},{"$f":"CH4wood","v":7.0000000000000007E-2},{"$f":"N2Owood","v":8.9999999999999993E-3}]
[7,"Other",0.8,0.1,9.9999999999999995E-7,0,{"$f":"co2input","v":0},0,0]

{"sheet":"CHPTech","index":10,"n_rows":231,"n_cols":12,"rows_kept":231,"cut":false,"hidden":true,"merged":[]}
["CHP Technologies"]
[]
[null,"Selected"]
[null,"Technology"]
[null,{"$f":"chptechinput","v":0},1,2,3,4,5,6,7,8,9]
[null,{"$f":"LOOKUP(B$5,C$5:W$5,C6:W6)","v":{"$error":"#N/A"}},{"$f":"B30","v":"Recip Rich Burn"},{"$f":"B54","v":"Recip Lean Burn"},{"$f":"B78","v":"Recip Diesel"},{"$f":"B102","v":"Microturbine"},{"$f":"B126","v":"Combustion Turbine"},{"$f":"B150","v":"Boiler / Steam Turbine"},{"$f":"B174","v":"Fuel Cell"},{"$f":"B198","v":"Other"},"Waste Heat to Power"]
["Capacity (kW)",{"$error":"#N/A"},{"$f":"B31","v":0},{"$f":"B55","v":0},{"$f":"B79","v":0},{"$f":"B103","v":0},{"$f":"B127","v":0},0,0,0,{"$f":"chpcapinput","v":0}]
["CapLow (kW)",{"$error":"#N/A"},{"$f":"B32","v":5},{"$f":"B56","v":500},{"$f":"B80","v":90},{"$f":"B104","v":30},{"$f":"B128","v":1000},100,5,0,50]
["CapHigh (kW)",{"$error":"#N/A"},{"$f":"B33","v":1200},{"$f":"B57","v":5000},{"$f":"B81","v":1600},{"$f":"B105","v":1000},{"$f":"B129","v":40000},15000,3000,0,10000]
["Misc",{"$error":"#N/A"},{"$f":"B34","v":"Catalyst"},{"$f":"B58","v":0},{"$f":"B82","v":0},{"$f":"B106","v":{"$error":"#N/A"}},{"$f":"B130","v":0},0,"ClearEdge SOFC",0]
["Fuel",{"$error":"#N/A"},"Natural Gas","Natural Gas","Diesel","Natural gas","Natural gas","Natural Gas","Natural Gas",{"$error":"#N/A"},"Waste Heat  "]
[]
["%",{"$f":"LOOKUP(B$5,C$5:W$5,C13:W13)","v":{"$error":"#N/A"}},0.22999662959218065,0.34959016393442621,0.29279176201372997,0.22536327608982826,0.21398557541549074,{"$f":"B157","v":0},{"$f":"B181","v":0.30008795074758138},{"$f":"B205","v":0},0]
["Btu/kWh HHV",{"$error":"#N/A"},14835,9760,11653.333333333334,15140,15945,{"$f":"B158","v":0},11370,0]
["Btu/kWh LHV",{"$error":"#N/A"},13425.339366515836,8832.5791855203624,10614.470284237726,13701.357466063349,14429.864253393665,{"$f":"B159","v":0},10289.592760180996,0]
["P/H ratio",{"$error":"#N/A"},0.4,0.79,0.66,0.51,0.44,{"$f":"B160","v":0},0.85,0]
["NOx ppm",{"$error":"#N/A"},0,0,0,12,42,{"$f":"B161","v":0},3,0,0]
["NOx gm/hp-hr",{"$error":"#N/A"},0.15,0.7,3,0,0,0,0,0,0]
["NOx lb/MMBtu",{"$error":"#N/A"},3.144590495449949E-2,0.22305327868852454,0.80062929061784893,4.2272126816380449E-2,0.15441176470588236,{"$error":"#N/A"},2.6385224274406332E-3,0,0]
["NOx lb/MWh",{"$error":"#N/A"},0.46649999999999997,2.1769999999999996,9.33,0.64,2.462095588235294,0,0.03,0,0]
["SO2 lb/MMBtu",{"$error":"#N/A"},5.9999999999999995E-4,5.9999999999999995E-4,0,0,5.9999999999999995E-4,{"$error":"#N/A"},1E-4,0,0]
["SO2 lb/MWh",{"$error":"#N/A"},8.9009999999999992E-3,5.8560000000000001E-3,0,0,9.5669999999999991E-3,0,1.137E-3,0,0]
["CO2 lb/MWh",{"$error":"#N/A"},1734.2114999999999,1140.944,0,0,0,0,1360,0,0]
[]
[]
[]
[null,"Detailed"]
[null,"Recip Rich Burn"]
[null,{"$f":"IF(chptechinput=1,1,0)","v":0},1,1,1,1,1,1,1]
[null,{"$f":"IF(B$31*chptechcaplow<B$32,C30,IF(B$31*chptechcaphigh>B$33,I30,LOOKUP(B$31,C$31:T$31,C30:T30)))","v":"Recip Rich Burn"},"Recip Rich Burn","Recip Rich Burn","Recip Rich Burn","Recip Rich Burn","Recip Rich Burn","Recip Rich Burn","Recip Rich Burn"]
["Capacity (kW)",{"$f":"chpcapinput","v":0},5,50,100,150,300,800,1200]
["CapLow (kW)",{"$f":"chptechcaplow*MIN(C31:AW31)","v":5}]
["CapHigh (kW)",{"$f":"chptechcaphigh*MAX(C31:AW31)","v":1200}]
["Misc","Catalyst","Catalyst","Catalyst","Catalyst","Catalyst","Catalyst","Catalyst","Catalyst"]
["Fuel","Natural Gas","Natural Gas","Natural Gas","Natural Gas","Natural Gas","Natural Gas","Natural Gas","Natural Gas"]
[]
["%",{"$f":"IF(B$31*chptechcaplow<B$32,C37,IF(B$31*chptechcaphigh>B$33,I37,LOOKUP(B$31,C$31:T$31,C37:T37)))","v":0.22999662959218065},{"$f":"3412/C38","v":0.22999662959218065},0.27875816993464053,0.28433333333333333,0.30409982174688055,0.31766129783074204,0.32495238095238094,0.33569460842188115]
["Btu/kWh HHV",14835,14835,12240,12000,11220,10741,10500,10164]
["Btu/kWh LHV",13425.339366515836,{"$f":"C38/1.105","v":13425.339366515836},{"$f":"D38/1.105","v":11076.923076923076},{"$f":"E38/1.105","v":10859.728506787331},{"$f":"F38/1.105","v":10153.846153846154},{"$f":"G38*0.91","v":9774.31},{"$f":"H38*0.91","v":9555},{"$f":"I38*0.91","v":9249.24}]
["P/H ratio",0.4,0.4,0.63,0.52,0.69,0.71,0.72,0.75]
["NOx ppm",0]
["NOx gm/hp-hr",0.15,0.15,0.15,0.15,0.15,0.15,0.15,0.15]
["NOx lb/MMBtu",3.144590495449949E-2,{"$f":"C44*1000/C38","v":3.144590495449949E-2},3.8112745098039212E-2,3.8874999999999993E-2,4.1577540106951867E-2,4.3431710269062465E-2,4.4428571428571421E-2,4.5897284533648164E-2]
["NOx lb/MWh",0.46649999999999997,{"$f":"C42*gmhphrlbMWh","v":0.46649999999999997},0.46649999999999997,0.46649999999999997,0.46649999999999997,0.46649999999999997,0.46649999999999997,0.46649999999999997]
["SO2 lb/MMBtu",5.9999999999999995E-4,5.9999999999999995E-4,5.9999999999999995E-4,5.9999999999999995E-4,5.9999999999999995E-4,5.9999999999999995E-4,5.9999999999999995E-4,{"$f":"0.000584/1.03","v":5.669902912621359E-4}]
["SO2 lb/MWh",8.9009999999999992E-3,{"$f":"C45*C38/1000","v":8.9009999999999992E-3},7.3439999999999998E-3,7.1999999999999989E-3,6.7319999999999993E-3,6.4445999999999991E-3,6.3E-3,5.7628893203883489E-3]
["CO2 lb/MWh",1734.2114999999999,{"$f":"co2gas*C38/1000","v":1734.2114999999999},1430.856,1402.8,1311.6179999999999,1255.6229000000001,1227.45,1188.1716000000001]
[]
[]
[]
[null,"Detailed"]
[null,"Recip Lean Burn"]
[null,{"$f":"IF(chptechinput=2,2,0)","v":0},2,2,2]
[null,{"$f":"IF(B$55*chptechcaplow<B$56,C54,IF(B$55*chptechcaphigh>B$57,E54,LOOKUP(B$55,C$55:S$55,C54:S54)))","v":"Recip Lean Burn"},"Recip Lean Burn","Recip Lean Burn","Recip Lean Burn"]
["Capacity (kW)",{"$f":"chpcapinput","v":0},500,3000,5000]
["CapLow (kW)",{"$f":"chptechcaplow*MIN(C55:AV55)","v":500}]
["CapHigh (kW)",{"$f":"chptechcaphigh*MAX(C55:AV55)","v":5000}]
["Misc",{"$f":"IF(B$55*chptechcaplow<B$56,C58,IF(B$55*chptechcaphigh>B$57,E58,LOOKUP(B$55,C$55:S$55,C58:S58)))","v":0}]
["Fuel",{"$f":"IF(B$55*chptechcaplow<B$56,C59,IF(B$55*chptechcaphigh>B$57,E59,LOOKUP(B$55,C$55:S$55,C59:S59)))","v":"Natural Gas"},"Natural Gas","Natural Gas","Natural Gas"]
[]
["%",{"$f":"IF(B$55*chptechcaplow<B$56,C61,IF(B$55*chptechcaphigh>B$57,E61,LOOKUP(B$55,C$55:S$55,C61:S61)))","v":0.34959016393442621},{"$f":"3412/C62","v":0.34959016393442621},{"$f":"3412/D62","v":0.35946059839865152},{"$f":"3412/E62","v":0.38958666362183147}]
["Btu/kWh HHV",9760,9760,9492,8758]
["Btu/kWh LHV",8832.5791855203624,{"$f":"C62/1.105","v":8832.5791855203624},{"$f":"D62/1.105","v":8590.0452488687788},{"$f":"E62/1.105","v":7925.7918552036199}]
["P/H ratio",0.79,0.79,0.97,1.1200000000000001]
["NOx ppm",0]
["NOx gm/hp-hr",0.7,0.7,0.7,0.5]
["NOx lb/MMBtu",0.22305327868852454,{"$f":"C68*1000/C62","v":0.22305327868852454},{"$f":"D68*1000/D62","v":0.22935103244837754},{"$f":"E68*1000/E62","v":0.1775519525005709}]
["NOx lb/MWh",2.1769999999999996,{"$f":"C66*gmhphrlbMWh","v":2.1769999999999996},{"$f":"D66*gmhphrlbMWh","v":2.1769999999999996},{"$f":"E66*gmhphrlbMWh","v":1.5549999999999999}]
["SO2 lb/MMBtu",5.9999999999999995E-4,5.9999999999999995E-4,5.9999999999999995E-4,5.9999999999999995E-4]
["SO2 lb/MWh",5.8560000000000001E-3,{"$f":"C69*C62/1000","v":5.8560000000000001E-3},{"$f":"D69*D62/1000","v":5.6952000000000001E-3},{"$f":"E69*E62/1000","v":5.2547999999999996E-3}]
["CO2 lb/MWh",1140.944,{"$f":"co2gas*C62/1000","v":1140.944},{"$f":"co2gas*D62/1000","v":1109.6148000000001},{"$f":"co2gas*E62/1000","v":1023.8102000000001}]
[]
[]
[]
[null,"Detailed"]
[null,"Recip Diesel"]
[null,{"$f":"IF(chptechinput=3,3,0)","v":0},3,3,3,3,3,3,3]
[null,{"$f":"IF(B$79*chptechcaplow<B$80,C78,IF(B$79*chptechcaphigh>B$81,I78,LOOKUP(B$79,C$79:C$79,C78:C78)))","v":"Recip Diesel"},"Recip Diesel","Recip Diesel","Recip Diesel","Recip Diesel","Recip Diesel","Recip Diesel","Recip Diesel"]
["Capacity (kW)",{"$f":"chpcapinput","v":0},90,160,320,545,680,1100,1600]
["CapLow (kW)",{"$f":"chptechcaplow*MIN(C79:AC79)","v":90}]
["CapHigh (kW)",{"$f":"chptechcaphigh*MAX(C79:AC79)","v":1600}]
["Misc",{"$f":"IF(B$79*chptechcaplow<B$80,C82,IF(B$79*chptechcaphigh>B$81,I82,LOOKUP(B$79,C$79:C$79,C82:C82)))","v":0}]
["Fuel",{"$f":"IF(B$79*chptechcaplow<B$80,C83,IF(B$79*chptechcaphigh>B$81,I83,LOOKUP(B$79,C$79:C$79,C83:C83)))","v":"Diesel"},"Diesel","Diesel","Diesel","Diesel","Diesel","Diesel","Diesel"]
[]
["%",{"$f":"IF(B$79*chptechcaplow<B$80,C85,IF(B$79*chptechcaphigh>B$81,I85,LOOKUP(B$79,C$79:C$79,C85:C85)))","v":0.29279176201372997},{"$f":"3412/C86","v":0.29279176201372997},{"$f":"3412/D86","v":0.31396365309408786},0.34701245868293923,0.33107930064451802,0.34311742088139602,0.3536684193663896,0.35415774655197019]
["Btu/kWh HHV",11653.333333333334,11653.333333333334,10867.5,9832.5,10305.688073394496,9944.1176470588234,9647.454545454546,9634.125]
["Btu/kWh LHV",10614.470284237726,{"$f":"C86*ppmbtudlhv/ppmbtud","v":10614.470284237726},9898.6918604651164,8955.959302325582,9386.9639428205683,9057.626538987688,8787.4101479915444,8775.2688953488378]
["P/H ratio",0.66,0.66,0.7,0.7,0.72,0.72,0.84,0.84]
["NOx ppm",0]
["NOx gm/hp-hr",3,3,3,3,3,3,3,3]
["NOx lb/MMBtu",0.80062929061784893,{"$f":"C92*1000/C86","v":0.80062929061784893},{"$f":"D92*1000/D86","v":0.85852311939268466},0.94889397406559883,0.90532528576006832,0.93824312333629101,0.96709447616893762,0.96843252500875798]
["NOx lb/MWh",9.33,{"$f":"C90*gmhphrlbMWh","v":9.33},{"$f":"D90*gmhphrlbMWh","v":9.33},9.33,9.33,9.33,9.33,9.33]
["SO2 lb/MMBtu",0]
["SO2 lb/MWh",0,{"$f":"C93*C86/1000","v":0},{"$f":"D93*D86/1000","v":0},0,0,0,0,0]
["CO2 lb/MWh",0]
[]
[]
[]
[null,"Detailed"]
[null,"Microturbine"]
[null,{"$f":"IF(chptechinput=4,4,0)","v":0},4,4,4,4]
[null,{"$f":"IF(B$103*chptechcaplow<B$104,C102,IF(B$103*chptechcaphigh>B$105,F102,LOOKUP(B$103,C$103:X$103,C102:X102)))","v":"Microturbine"},"Microturbine","Microturbine","Microturbine","Microturbine"]
["Capacity (kW)",{"$f":"chpcapinput","v":0},30,65,200,1000]
["CapLow (kW)",{"$f":"chptechcaplow*MIN(C103:BA103)","v":30}]
["CapHigh (kW)",{"$f":"chptechcaphigh*MAX(C103:BA103)","v":1000}]
["Misc",{"$f":"LOOKUP(B$103,C$103:X$103,C106:X106)","v":{"$error":"#N/A"}}]
["Fuel",{"$f":"IF(B$103*chptechcaplow<B$104,C107,IF(B$103*chptechcaphigh>B$105,F107,LOOKUP(B$103,C$103:X$103,C107:X107)))","v":"Natural gas"},"Natural gas","Natural gas","Natural gas","Natural gas"]
[]
["%",{"$f":"IF(B$103*chptechcaplow<B$104,C109,IF(B$103*chptechcaphigh>B$105,F109,LOOKUP(B$103,C$103:X$103,C109:X109)))","v":0.22536327608982826},{"$f":"3412/C110","v":0.22536327608982826},{"$f":"3412/D110","v":0.26167650893473426},{"$f":"3412/E110","v":0.2998242530755712},{"$f":"3412/F110","v":0.2998242530755712}]
["Btu/kWh HHV",15140,15140,13039,11380,11380]
["Btu/kWh LHV",13701.357466063349,{"$f":"C110/1.105","v":13701.357466063349},{"$f":"D110/1.105","v":11800},{"$f":"E110/1.105","v":10298.642533936652},{"$f":"F110/1.105","v":10298.642533936652}]
["P/H ratio",0.51,0.51,0.54,0.71,0.71]
["NOx ppm",12,12,9,9,9]
["NOx gm/hp-hr",0]
["NOx lb/MMBtu",4.2272126816380449E-2,{"$f":"C116*1000/C110","v":4.2272126816380449E-2},{"$f":"D116*1000/D110","v":3.5278779047472966E-2},{"$f":"E116*1000/E110","v":3.5149384885764502E-2},{"$f":"F116*1000/F110","v":3.5149384885764502E-2}]
["NOx lb/MWh",0.64,0.64,0.46,0.4,0.4]
["SO2 lb/MMBtu",0]
["SO2 lb/MWh",0,{"$f":"C117*C110/1000","v":0},{"$f":"D117*D110/1000","v":0},{"$f":"E117*E110/1000","v":0},{"$f":"F117*F110/1000","v":0}]
["CO2 lb/MWh",0]
[]
[]
[]
[null,"Detailed"]
[null,"Combustion Turbine"]
[null,{"$f":"IF(chptechinput=5,5,0)","v":0},5,5,5,5,5]
[null,{"$f":"IF(B$127*chptechcaplow<B$128,C126,IF(B$127*chptechcaphigh>B$129,F126,LOOKUP(B$127,C$127:X$127,C126:X126)))","v":"Combustion Turbine"},"Combustion Turbine","Combustion Turbine","Combustion Turbine","Combustion Turbine","Combustion Turbine"]
["Capacity (kW)",{"$f":"chpcapinput","v":0},1000,5000,10000,25000,40000]
["CapLow (kW)",{"$f":"chptechcaplow*MIN(C127:BA127)","v":1000}]
["CapHigh (kW)",{"$f":"chptechcaphigh*MAX(C127:BA127)","v":40000}]
["Misc",{"$f":"IF(B$127*chptechcaplow<B$128,C130,IF(B$127*chptechcaphigh>B$129,F130,LOOKUP(B$127,C$127:X$127,C130:X130)))","v":0}]
["Fuel",{"$f":"IF(B$127*chptechcaplow<B$128,C131,IF(B$127*chptechcaphigh>B$129,F131,LOOKUP(B$127,C$127:X$127,C131:X131)))","v":"Natural gas"},"Natural gas","Natural gas","Natural gas","Natural gas","Natural gas"]
[]
["%",{"$f":"IF(B$127*chptechcaplow<B$128,C133,IF(B$127*chptechcaphigh>B$129,F133,LOOKUP(B$127,C$127:X$127,C133:X133)))","v":0.21398557541549074},{"$f":"3412/C134","v":0.21398557541549074},{"$f":"3412/D134","v":0.28900559037777401},{"$f":"3412/E134","v":0.29100213219616206},{"$f":"3412/F134","v":0.34308697838109603},{"$f":"3412/G134","v":0.3700650759219089}]
["Btu/kWh HHV",15945,15945,11806,11725,9945,9220]
["Btu/kWh LHV",14429.864253393665,{"$f":"C134/1.105","v":14429.864253393665},{"$f":"D134/1.105","v":10684.162895927602},{"$f":"E134/1.105","v":10610.859728506788},{"$f":"F134/1.105","v":9000},{"$f":"G134/1.105","v":8343.8914027149331}]
["P/H ratio",0.44,0.44,0.62,0.69,0.94,1.07]
["NOx ppm",42,42,25,25,15,15]
["NOx gm/hp-hr",0]
["NOx lb/MMBtu",0.15441176470588236,{"$f":"C140*1000/C134","v":0.15441176470588236},{"$f":"D140*1000/D134","v":9.1911764705882359E-2},{"$f":"E140*1000/E134","v":9.1911764705882359E-2},{"$f":"F140*1000/F134","v":5.514705882352941E-2},{"$f":"G140*1000/G134","v":5.514705882352941E-2}]
["NOx lb/MWh",2.462095588235294,{"$f":"(C137/272)*C134/1000","v":2.462095588235294},{"$f":"(D137/272)*D134/1000","v":1.0851102941176471},{"$f":"(E137/272)*E134/1000","v":1.0776654411764708},{"$f":"(F137/272)*F134/1000","v":0.54843750000000002},{"$f":"(G137/272)*G134/1000","v":0.50845588235294115}]
["SO2 lb/MMBtu",5.9999999999999995E-4,5.9999999999999995E-4,5.9999999999999995E-4,5.9999999999999995E-4,5.9999999999999995E-4,5.9999999999999995E-4]
["SO2 lb/MWh",9.5669999999999991E-3,{"$f":"C141*C134/1000","v":9.5669999999999991E-3},{"$f":"D141*D134/1000","v":7.0835999999999998E-3},{"$f":"E141*E134/1000","v":7.0349999999999996E-3},{"$f":"F141*F134/1000","v":5.9669999999999992E-3},{"$f":"G141*G134/1000","v":5.5319999999999987E-3}]
["CO2 lb/MWh",0]
[]
[]
[]
[null,"Detailed"]
[null,"Boiler / Steam Turbine"]
[null,{"$f":"IF(chptechinput=6,6,0)","v":0},6,6,6,6]
[null,{"$f":"IF(B$151*chptechcaplow<B$152,C150,IF(B$151*chptechcaphigh>B$153,D150,LOOKUP(B$151,C$151:X$151,C150:X150)))","v":"Boiler / Steam Turbine"},"Boiler / Steam Turbine","Boiler / Steam Turbine","Boiler / Steam Turbine","Boiler / Steam Turbine"]
["Capacity (kW)",{"$f":"chpcapinput","v":0},100,500,3000,15000]
["CapLow (kW)",{"$f":"chptechcaplow*MIN(C151:BA151)","v":100}]
["CapHigh (kW)",{"$f":"chptechcaphigh*MAX(C151:BA151)","v":15000}]
["Misc",{"$f":"IF(B$151*chptechcaplow<B$152,C154,IF(B$151*chptechcaphigh>B$153,D154,LOOKUP(B$151,C$151:X$151,C154:X154)))","v":0}]
["Fuel",{"$f":"IF(B$151*chptechcaplow<B$152,C155,IF(B$151*chptechcaphigh>B$153,D155,LOOKUP(B$151,C$151:X$151,C155:X155)))","v":"Natural Gas"},"Natural Gas","Natural Gas","Natural Gas","Natural Gas"]
[]
["%",{"$f":"IF(B$151*chptechcaplow<B$152,C157,IF(B$151*chptechcaphigh>B$153,D157,LOOKUP(B$151,C$151:X$151,C157:X157)))","v":0}]
["Btu/kWh HHV",0]
["Btu/kWh LHV",0]
["P/H ratio",0]
["NOx ppm",0]
["NOx gm/hp-hr",0]
["NOx lb/MMBtu",{"$f":"STMTech!D23","v":{"$error":"#N/A"}}]
["NOx lb/MWh",0]
["SO2 lb/MMBtu",{"$f":"STMTech!F23","v":{"$error":"#N/A"}},5.9999999999999995E-4,5.9999999999999995E-4,5.9999999999999995E-4,5.9999999999999995E-4]
["SO2 lb/MWh",0,{"$f":"C165*C158/1000","v":0},{"$f":"D165*D158/1000","v":0},{"$f":"E165*E158/1000","v":0},{"$f":"F165*F158/1000","v":0}]
["CO2 lb/MWh",0,{"$f":"co2gas*CHPTech!C158/1000","v":0},{"$f":"co2gas*CHPTech!D158/1000","v":0},{"$f":"co2gas*CHPTech!E158/1000","v":0},{"$f":"co2gas*CHPTech!F158/1000","v":0}]
[]
[]
[]
[null,"Detailed"]
[null,"Fuel Cell"]
[null,{"$f":"IF(chptechinput=7,7,0)","v":0},7,7,7,7,7]
[null,{"$f":"IF(B$175*chptechcaplow<B$176,C174,IF(B$175*chptechcaphigh>B$177,D174,LOOKUP(B$175,C$175:X$175,C174:X174)))","v":"Fuel Cell"},"Fuel Cell","Fuel Cell","Fuel Cell","Fuel Cell","Fuel Cell"]
["Capacity (kW)",{"$f":"chpcapinput","v":0},5,300,400,1500,3000]
["CapLow (kW)",{"$f":"chptechcaplow*MIN(C175:BA175)","v":5}]
["CapHigh (kW)",{"$f":"chptechcaphigh*MAX(C175:BA175)","v":3000}]
["Misc",{"$f":"IF(B$175*chptechcaplow<B$176,C178,IF(B$175*chptechcaphigh>B$177,D178,LOOKUP(B$175,C$175:X$175,C178:X178)))","v":"ClearEdge SOFC"},"ClearEdge SOFC","FuelCell MCFC","UTC PAFC","FuelCell MCFC","FuelCell MCFC"]
["Fuel",{"$f":"IF(B$175*chptechcaplow<B$176,C179,IF(B$175*chptechcaphigh>B$177,D179,LOOKUP(B$175,C$175:X$175,C179:X179)))","v":"Natural Gas"},"Natural Gas","Natural Gas","Natural Gas","Natural Gas","Natural Gas"]
[]
["%",{"$f":"IF(B$175*chptechcaplow<B$176,C181,IF(B$175*chptechcaphigh>B$177,D181,LOOKUP(B$175,C$175:X$175,C181:X181)))","v":0.30008795074758138},{"$f":"3412/C182","v":0.30008795074758138},{"$f":"3412/D182","v":0.42533034156070804},{"$f":"3412/E182","v":0.37995545657015589},{"$f":"3412/F182","v":0.42533034156070804},{"$f":"3412/G182","v":0.42533034156070804}]
["Btu/kWh HHV",11370,11370,8022,8980,8022,8022]
["Btu/kWh LHV",10289.592760180996,{"$f":"C182/1.105","v":10289.592760180996},{"$f":"D182/1.105","v":7259.7285067873308},{"$f":"E182/1.105","v":8126.6968325791859},{"$f":"F182/1.105","v":7259.7285067873308},{"$f":"G182/1.105","v":7259.7285067873308}]
["P/H ratio",0.85,0.85,1.27,1.42,1.27,1.27]
["NOx ppm",3,3]
["NOx gm/hp-hr",0]
["NOx lb/MMBtu",2.6385224274406332E-3,{"$f":"C188*1000/C182","v":2.6385224274406332E-3},{"$f":"D188*1000/D182","v":1.2465719272001994E-3},{"$f":"E188*1000/E182","v":2.2271714922048997E-3},{"$f":"F188*1000/F182","v":1.2465719272001994E-3},{"$f":"G188*1000/G182","v":1.2465719272001994E-3}]
["NOx lb/MWh",0.03,0.03,0.01,0.02,0.01,0.01]
["SO2 lb/MMBtu",1E-4,1E-4,1E-4,1E-4,1E-4,1E-4]
["SO2 lb/MWh",1.137E-3,{"$f":"C189*C182/1000","v":1.137E-3},{"$f":"D189*D182/1000","v":8.0219999999999998E-4},{"$f":"E189*E182/1000","v":8.9800000000000004E-4},{"$f":"F189*F182/1000","v":8.0219999999999998E-4},{"$f":"G189*G182/1000","v":8.0219999999999998E-4}]
["CO2 lb/MWh",1360,1360,1170,1135,950,890]
[]
[]
[]
[null,"User Defined"]
[null,"CHP"]
[null,{"$f":"IF(chptechinput=8,8,0)","v":0},8]
[null,{"$f":"IF(B$199*chptechcaplow<B$200,C198,IF(B$199*chptechcaphigh>B$201,C198,LOOKUP(B$199,C$199:X$199,C198:X198)))","v":"Other"},"Other"]
["Capacity (kW)",{"$f":"chpcapinput","v":0},{"$f":"chpcapinput","v":0}]
["CapLow (kW)",{"$f":"chptechcaplow*MIN(C199:BA199)","v":0}]
["CapHigh (kW)",{"$f":"chptechcaphigh*MAX(C199:BA199)","v":0}]
["Misc",{"$f":"IF(B$199*chptechcaplow<B$200,C202,IF(B$199*chptechcaphigh>B$201,C202,LOOKUP(B$199,C$199:X$199,C202:X202)))","v":0}]
["Fuel",{"$f":"IF(B$199*chptechcaplow<B$200,C203,IF(B$199*chptechcaphigh>B$201,C203,LOOKUP(B$199,C$199:X$199,C203:X203)))","v":{"$error":"#N/A"}},{"$f":"LOOKUP(chpfuelinput,lista6a,lista6)","v":{"$error":"#N/A"}}]
[]
["%",{"$f":"IF(B$199*chptechcaplow<B$200,C205,IF(B$199*chptechcaphigh>B$201,C205,LOOKUP(B$199,C$199:X$199,C205:X205)))","v":0},{"$f":"chpeffinput1","v":0}]
["Btu/kWh HHV",0,{"$f":"chpeffinput2","v":0}]
["Btu/kWh LHV",0,{"$f":"chpeffinput3","v":0}]
["P/H ratio",0,{"$f":"chpphinput","v":0}]
["NOx ppm",0,{"$f":"chpnoxinput1","v":0}]
["NOx gm/hp-hr",0,{"$f":"chpnoxinput2","v":0}]
["NOx lb/MMBtu",0,{"$f":"chpnoxinput3","v":0}]
["NOx lb/MWh",0,{"$f":"C211*C206/1000","v":0}]
["SO2 lb/MMBtu",0]
["SO2 lb/MWh",0,{"$f":"C213*C206/1000","v":0}]
["CO2 lb/MWh",0]
[]
[]
[]
[]
[null,"Duct Burner"]
[null,{"$f":"chpfuelinput","v":0},1,2,3,4,5,6,null,"Duct Burner emissions data from:"]
["NOx lb/MMBtu",{"$f":"LOOKUP(chpfuelinput,C221:I221,C222:H222)","v":{"$error":"#N/A"}},0.08,0.08,0.08,0.08,null,null,null,"Solar Turbines Inc"]
["NOx ppm",{"$f":"LOOKUP(chpfuelinput,C221:I221,C223:H223)","v":{"$error":"#N/A"}},{"$f":"C222*ppmbtu","v":21.76},{"$f":"D222*ppmbtud","v":20.64},{"$f":"E222*ppmbtud","v":20.64},{"$f":"F222*ppmbtu","v":21.76}]
[]
[]
[]
[]
[null,"Absorbtion Cooler","Recip Engine - Rich Burn, natural gas","Recip Engine - Lean Burn, natural gas","Recip Engine - Diesel","Microturbine","Combustion Turbine","Boiler / Steam Turbine","Fuel Cell","Other",null,"Absorption Chiller Data from:"]
[null,{"$f":"chptechinput","v":0},1,2,3,4,5,6,7,8,null,"Application Engineering Manual for Integrated Systems Design"]
["Single Effect",{"$f":"LOOKUP(chptechinput,C229:M229,C230:M230)","v":{"$error":"#N/A"}},0.7,0.7,0.7,0.7,0.7,0.7,0.7,0.7,null,"American Gas Cooling Center"]
["Double Effect",{"$f":"LOOKUP(chptechinput,C230:M230,C231:M231)","v":{"$error":"#N/A"}},1.4,1.4,1.4,1.4,1.4,1.4,1.4,1.4,null,"March 1999"]

{"sheet":"EGRID","index":11,"n_rows":94,"n_cols":124,"rows_kept":94,"cut":false,"hidden":true,"merged":[]}
["eGRID2012 Version 1.0 NERC Region File (Year 2012 Data) "]
[null,null,null,null,null,null,null,null,null,null,null,null,null,null,null,null,null,null,null,null,null,null,null,null,null,null,null,null,null,null,null,null,null,null,null,null,null,null,null,null,null,null,null,null,null,null,null,null,null,null,null,null,null,null,null,null,null,null,null,null,null,null,null,null,null,null,null,null,null,null,null,null,null,null,null,null,null,"Calc","Calc"]
[null,null,null,null,"NAMEPCAP","STHTIAN","STHTIOZ","STNGENAN","STNGENOZ","STNOXAN","STNOXOZ","STSO2AN","STCO2AN","STCH4AN","STN2OAN","STCO2EQA","STHGAN","STNOXRTA","STNOXRTO","STSO2RTA","STCO2RTA","STCH4RTA","STN2ORTA","STC2ERTA","STHGRTA","STNOXRA","STNOXRO","STSO2RA","STCO2RA","STHGRA","STNOXCRT","STNOXCRO","STSO2CRT","STCO2CRT","STCH4CRT","STN2OCRT","STHGCRT","STCNOXRT","STONOXRT","STGNOXRT","STFSNXRT","STCNXORT","STONXORT","STGNXORT","STFSNORT","STCSO2RT","STOSO2RT","STGSO2RT","STFSS2RT","STCCO2RT","STOCO2RT","STGCO2RT","STFSC2RT","STCHGRT","STFSHGRT","STCNOXR","STONOXR","STGNOXR","STFSNXR","STCNXOR","STONXOR","STGNXOR","STFSNOR","STCSO2R","STOSO2R","STGSO2R","STFSS2R","STCCO2R","STOCO2R","STGCO2R","STFSC2R","STCHGR","STFSHGR","STNBNOX","STNBNXO","STNBSO2","STNBCO2","STNBCH4","STNBN2O","SRNBC2ER","STNBHG","STGENACL","STGENAOL","STGENAGS","STGENANC","STGENAHY","STGENABM","STGENAWI","STGENASO","STGENAGT","STGENAOF","STGENAOP","STGENATN","STGENATR","STGENATH","STGENACY","STGENACN","STCLPR","STOLPR","STGSPR","STNCPR","STHYPR","STBMPR","STWIPR","STSOPR","STGTPR","STOFPR","STOPPR","STTNPR","STTRPR","STTHPR","STCYPR","STCNPR",null,"STAHR"]
["SEQST00\ntate sequence number","SEQST99\nState sequence number","PSTATABB\nState abbreviation","FIPST\nFIPS State code","State nameplate capacity (MW)","State annual heat input (MMBtu)","State ozone season heat input (MMBtu)","State annual net generation (MWh)","State ozone season net generation (MWh)","State annual NOx emissions (tons)","State ozone season NOx emissions (tons)","State annual SO2 emissions (tons)","State annual CO2 emissions (tons)","State annual CH4 emissions (lbs)","State annual N2O emissions (lbs)","State annual CO2 equivalent emissions (tons)","State annual Hg emissions (lbs)","State annual NOx total output emission rate (lb/MWh)","State ozone season NOx total output emission rate (lb/MWh)","State annual SO2 total output emission rate (lb/MWh)","State annual CO2 total output emission rate (lb/MWh)","State annual CH4 total output emission rate (lb/GWh)","State annual N2O total output emission rate (lb/GWh)","State annual CO2 equivalent total output emission rate (lb/MWh)","State annual Hg total output emission rate (lb/GWh)","State annual NOx input emission rate (lb/MMBtu)","State ozone season NOx input emission rate (lb/MMBtu)","State annual SO2 input emission rate (lb/MMBtu)","State annual CO2 input emission rate (lb/MMBtu)","State annual Hg input emission rate (lb/BBtu)","State annual NOx combustion output emission rate (lb/MWh)","State ozone season NOx combustion output emission rate (lb/MWh)","State annual SO2 combustion output emission rate (lb/MWh)","State annual CO2 combustion output emission rate (lb/MWh)","State annual CH4 combustion output emission rate (lb/GWh)","State annual N2O combustion output emission rate (lb/GWh)","State annual Hg combustion output emission rate (lb/GWh)","State annual NOx coal output emission rate (lb/MWh)","State annual NOx oil output emission rate (lb/MWh)","State annual NOx gas output emission rate (lb/MWh)","State annual NOx fossil fuel output emission rate (lb/MWh)","State ozone season NOx coal output emission rate (lb/MWh)","State ozone season NOx oil output emission rate (lb/MWh)","State ozone season NOx gas output emission rate (lb/MWh)","State ozone season NOx fossil fuel output emission rate (lb/MWh)","State annual SO2 coal output emission rate (lb/MWh)","State annual SO2 oil output emission rate (lb/MWh)","State annual SO2 gas output emission rate (lb/MWh)","State annual SO2 fossil fuel output emission rate (lb/MWh)","State annual CO2 coal output emission rate (lb/MWh)","State annual CO2 oil output emission rate (lb/MWh)","State annual CO2 gas output emission rate (lb/MWh)","State annual CO2 fossil fuel output emission rate (lb/MWh)","State annual Hg coal output emission rate (lb/GWh)","State annual Hg fossil fuel output emission rate (lb/GWh)","State annual NOx coal input emission rate (lb/MMBtu)","State annual NOx oil input emission rate (lb/MMBtu)","State annual NOx gas input emission rate (lb/MMBtu)","State annual NOx fossil fuel input emission rate (lb/MMBtu)","State ozone season NOx coal input emission rate (lb/MMBtu)","State ozone season NOx oil input emission rate (lb/MMBtu)","State ozone season NOx gas input emission rate (lb/MMBtu)","State ozone season NOx fossil fuel input emission rate (lb/MMBtu)","State annual SO2 coal input emission rate (lb/MMBtu)","State annual SO2 oil input emission rate (lb/MMBtu)","State annual SO2 gas input emission rate (lb/MMBtu)","State annual SO2 fossil fuel input emission rate (lb/MMBtu)","State annual CO2 coal input emission rate (lb/MMBtu)","State annual CO2 oil input emission rate (lb/MMBtu)","State annual CO2 gas input emission rate (lb/MMBtu)","State annual CO2 fossil fuel input emission rate (lb/MMBtu)","State annual Hg coal input emission rate (lb/BBtu)","State annual Hg fossil fuel input emission rate (lb/BBtu)","State annual NOx non-baseload output emission rate (lb/MWh)","State ozone season NOx non-baseload output emission rate (lb/MWh)","State annual SO2 non-baseload output emission rate (lb/MWh) ","State annual CO2 non-baseload  output emission rate (lb/MWh) ","State annual CH4 non-baseload output emission rate (lb/GWh)","State annual N2O non-baseload output emission rate (lb/GWh)","eGRID subregion annual CO2 equivalent non-baseload output emission rate (lb/MWh)","State annual Hg non-baseload  output emission rate (lb/GWh) ","State annual coal net generation (MWh)","State annual oil net generation (MWh)","State annual gas net generation (MWh)","State annual nuclear net generation (MWh)","State annual hydro net generation (MWh)","State annual biomass net generation (MWh)","State annual wind net generation (MWh)","State annual solar net generation (MWh)","State annual geothermal net generation (MWh)","State annual other fossil net generation (MWh)","State annual other unknown/ purchased fuel net generation (MWh)","State annual total nonrenewables net generation (MWh)","State annual total renewables net generation (MWh)","State annual total nonhydro renewables net generation (MWh)","State annual total combustion net generation (MWh)","State annual total noncombustion net generation (MWh)","State coal generation percent (resource mix)","State oil generation percent (resource mix)","State gas generation percent (resource mix)","State nuclear generation percent (resource mix)","State hydro generation percent (resource mix)","State biomass generation percent (resource mix)","State wind generation percent (resource mix)","State solar generation percent (resource mix)","State geothermal generation percent (resource mix)","State other fossil  generation percent (resource mix)","State other unknown/ purchased fuel generation percent (resource mix)","State total nonrenewables generation percent (resource mix)","State total renewables generation percent (resource mix)","State total nonhydro renewables generation percent (resource mix)","State total combustion generation percent (resource mix)","State total noncombustion generation percent (resource mix)",null,"Total Annual Heat Rate (Btu/kWh)","Fossil Annual Heat Rate (Btu/kWh)","Non-Baseload Annual Heat Rate (Btu/kWh)","Coal Annual Heat Rate (Btu/kWh)","Oil Annual Heat Rate (Btu/kWh)","Natural Gas Annual Heat Rate (Btu/kWh)",null,"Calculated Fossil CO2 - lb/MWh"]
[]
[]
[1,1,"US Average",null,1309394.6000000015,26820073797.080128,12638695177.892195,4045517914.7444024,1843039497.3380883,1913686.858242274,871745.09198158106,3817422.302762433,2298924483.3547387,96199568.677199394,64226468.254707657,2309886780.3524904,"N/A",0.94607755969518759,0.94598633750459193,1.8872353964120905,1136.5291326364011,23.77929617530252,15.87595694994358,1141.9486103046611,"N/A",0.14270556246199553,0.1379485903744955,0.2846690379485855,171.43312138127078,"N/A",1.3482405449851331,1.348110545647655,2.6894700685995074,1619.650145460454,33.887508382591903,22.624581495462905,"N/A",2.0270000000000001,3.3875000000000002,0.39729999999999999,1.3268,2.0017,3.1132,0.43190000000000001,1.2959000000000001,4.4062999999999999,13.383599999999999,8.4400000000000003E-2,2.5741000000000001,2173.9845285900478,1904.3003000000001,940.72305641832907,1640.1344999999999,"N/A","N/A",0.1925,0.32750000000000001,5.0099999999999999E-2,0.14130000000000001,0.189,0.32779999999999998,5.3199999999999997E-2,0.1371,0.41860000000000003,1.294,1.06E-2,0.27410000000000001,207.31939632518819,177.07578910169178,119.43912316493781,174.66069999999999,"N/A","N/A",1.3554999999999999,1.5557000000000001,2.9317000000000002,1549.3559,30.994,19.864699999999999,null,"N/A",1513655622.6472657,28456965.99530948,1225584924.397826,769331249,271170205.06999999,58270939.289264001,139474311.99000001,4188545.395,15544648,14899401.085735997,4941101.8760000002,3556869265.0021391,488648649.74426395,217478444.67426416,2838791438.7537961,1199708959.4550002,37.415620312310473,0.7034196015198565,30.294883133035363,19.016879055116153,6.7029787232355549,1.4403826782446862,3.4476256175178017,0.10353545536739105,0.38424370692675869,0.36829403304415598,0.12213768373121099,87.921233818757273,12.07876618129219,5.3757874580566414,70.171273458151333,29.655262558163663,null,{"$f":"F7*1000000/(H7*1000)","v":6629.5773155103261},{"$f":"(F7*((CT7+CU7+CV7+DC7)/DH7)*1000000/((CD7+CE7+CF7+CM7)*1000))","v":9447.7084265316407},{"$f":"1000*BY7/BS7","v":8870.6612306031057},{"$f":"1000*AX7/BP7","v":10486.160808514376},10754.153967973516,7876.1718228561549,null,{"$f":"DL7*BS7/1000","v":1650.1433671739148},null,{"$f":"DR7-AH7","v":30.493221713460798}]
[2,63,"ASCC Alaska Grid",null,2007.8,50103432.267028227,19891193.805571765,5331367.9560000002,2001058.1429999999,6915.8510314035366,2806.5336470109951,2108.7778844342511,3382036.9512384343,140402.66506710375,40490.484024481855,3389787.2042454341,"N/A",2.5944001946518571,2.8050495752246567,0.7910832273585624,1268.7313947003938,26.335204440183595,7.5947644879609681,1271.6388109849058,-0.57564963163836824,0.27606296489011906,0.28218855785567287,8.4176983053593446E-2,135.00220636437575,"N/A",2.8904687270102682,3.12515705619129,0.8813602981744757,1413.5168610136941,29.340533126188479,8.4614660786383151,"N/A",6.2821999999999996,2.6999,2.2475000000000001,2.8904999999999998,6.024,2.9056999999999999,2.5059,3.1031,3.5739999999999998,2.6446000000000001,3.8300000000000001E-2,0.88139999999999996,2165.0120000000002,1358.2603999999999,1273.3224,1413.5169000000001,"N/A","N/A",0.61680000000000001,0.3221,0.2064,0.27610000000000001,0.60770000000000002,0.32119999999999999,0.2155,0.28220000000000001,0.35089999999999999,0.3155,3.5000000000000001E-3,8.4199999999999997E-2,212.5771,162.04599999999999,116.9251,135.00219999999999,"N/A","N/A",2.5108000000000001,2.2915000000000001,0.30880000000000002,1377.7678000000001,28.6615,3.3794,1379.4173000000001,"N/A",684959.15500000003,613740.24200000009,3486580.5590000004,0,546088,0,0,0,0,0,0,4785279.9560000002,546088,0,4785279.9560000002,546088,12.847718646564937,11.511871757215477,65.397484993999541,0,10.242924602220045,0,0,0,0,0,0,89.757075397779957,10.242924602220045,0,89.757075397779957,10.242924602220045,null,9397.8567378079933,10470.32414565553,10205.521095211783,10184.596553438729,8381.9433987879984,10890.068941570287,null,1413.5167943766169,null,-6.6637077225095709E-5]
[3,64,"ASCC Miscellaneous",null,754.19999999999993,5109037.8596188929,2088417.5909048864,1596926.54,575965.99733333313,4812.5344558754314,2012.3242408342373,275.47377688934722,384195.7685426512,29787.024836420649,5666.2565150279752,385386.80206326267,"N/A",6.0272458817992103,6.9876494451099678,0.34500494542391064,481.1689942139119,18.652720767243714,3.5482261538642694,482.66065145772166,-6.5713730326004853,1.8839298467185055,1.9271282233955147,0.10783782953211316,150.39848170994381,"N/A",17.541537994864864,20.336671282373988,1.0040933250865203,1400.3815937627992,54.286388254752573,10.326664136987796,"N/A","N/A",20.638500000000001,6.5594999999999999,17.541499999999999,"N/A",20.6556,6.5594999999999999,17.889600000000002,"N/A",1.2763,3.8899999999999997E-2,1.0041,"N/A",1453.8778,1210.6803,1400.3815999999999,"N/A","N/A","N/A",2.2890999999999999,0.63329999999999997,1.8838999999999999,"N/A",2.2898000000000001,0.63329999999999997,1.9271,"N/A",0.1416,3.8E-3,0.10780000000000001,"N/A",161.25470000000001,116.8879,150.39850000000001,"N/A","N/A",18.605499999999999,18.718299999999999,1.0811999999999999,1404.4916000000001,55.644199999999998,10.6976,1408.9764,"N/A",0,424021.34900000005,122114.819,0,1028957,2565.3719999999998,19268,0,0,0,0,546136.16800000006,1050790.372,21833.371999999999,548701.54,1048225,0,26.552339032451677,7.6468651463454291,0,64.433583776496064,0.16064433370867515,1.2065677109981527,0,0,0,0,34.199204178797103,65.800795821202897,1.3672120447068277,34.359848512505778,65.640151487494222,null,3199.2942265327324,9311.1418269737151,9338.4681363178479,"-",{"$f":"1000*AY9/BQ9","v":9016.0336411899934},10357.618709892127,null,1400.3817640641064,null,1.7030130720740999E-4]
[4,65,"ERCOT All",null,115223.89999999992,2523758252.6122041,1265106191.9410806,360221517.29580003,174463757.72958341,109604.19227257083,52291.099984574037,346399.69942373456,205873315.51288,6015952.8009627005,4443234.9563777614,206625056.64048168,"N/A",0.60853773031314007,0.59944942909718324,1.9232593434405223,1143.03730137156,16.700703628491553,12.334729445740322,1147.2110727400504,-8.5747237510623117E-2,8.6857916885759986E-2,8.2666736306685265E-2,0.2745109988765328,163.14820589475383,"N/A",0.75221440133976991,0.74098033857288337,2.3773437596100901,1412.9101229562141,20.643764808788941,15.246977571860908,"N/A",1.3090999999999999,2.6528999999999998,0.39050000000000001,0.754,1.2599,2.7768999999999999,0.39019999999999999,0.72260000000000002,4.9743000000000004,89.738600000000005,8.8000000000000005E-3,2.3855,2252.0234,3061.8507,881.99504994877407,1418.1325999999999,"N/A","N/A",0.1249,0.189,5.2299999999999999E-2,8.7099999999999997E-2,0.11890000000000001,0.19789999999999999,5.1400000000000001E-2,8.2799999999999999E-2,0.47460000000000002,6.3935000000000004,1.1999999999999999E-3,0.27550000000000002,214.86689999999999,218.14449999999999,118.03734881056778,163.78819999999999,"N/A","N/A",0.72489999999999999,0.85229999999999995,2.0299,1280.5898999999999,21.530899999999999,10.707000000000001,1284.3613,"N/A",109893817.39680001,3404969.3039999995,176680238.29700002,38441017,392973.42000000004,712025.00300000003,29851836,118265,0,433813.20500000002,292562.67,329146417.87279999,31075099.423,30682126.002999999,291417425.87580001,68804091.420000002,30.507288465658046,0.94524317413386783,49.047663677435736,10.671493832067149,0.10909215611273589,0.19766309584868927,8.2870774139477135,3.283118701176458E-2,0,0.12042956463474372,8.1217433149546922E-2,91.373336147079087,8.6266638529209043,8.5175716968081669,80.899505410860627,19.100494589139362,null,7006.1285387896214,8660.2859970625468,7818.5724002095385,{"$f":"1000*AX10/BP10","v":10481.015921949822},14035.883095837851,7472.1692653758573,null,1418.4526549440798,null,5.5425319878656865]
[5,66,"FRCC All",null,80756.100000000006,1640755276.180264,784793331.4321754,211244527.48759997,99311487.290116638,65764.227954776434,32261.830247811431,134754.30225533311,118861947.31040302,8459346.3787531853,2503826.0785921579,119338507.31879841,"N/A",0.62263603925679722,0.64970994047376607,1.2758134268187673,1125.3493638303146,40.045280601409893,11.852738191000627,1129.8612914439032,-7.3109586239608323E-2,8.0163360020243685E-2,8.2217391396373282E-2,0.16425886810986934,144.88686891456209,"N/A",0.68138703166408343,0.71101558514103469,1.3961972469420176,1231.5356231558383,43.823892548397986,12.971144591465709,"N/A",1.5429999999999999,15.084899999999999,0.32079999999999997,0.59789999999999999,1.5943000000000001,20.3413,0.34399999999999997,0.63190000000000002,3.2294,0.8357,0.12959999999999999,0.82979999999999998,2171.2136309231232,3655.6637000000001,900.95851555787772,1216.7134000000001,"N/A","N/A",0.1462,0.66979999999999995,4.1200000000000001E-2,7.1099999999999997E-2,0.15240000000000001,0.65969999999999995,4.36E-2,7.4499999999999997E-2,0.30599999999999999,3.7100000000000001E-2,1.67E-2,9.8699999999999996E-2,205.70163436457645,162.32740000000001,121.97163633136846,144.6841,"N/A","N/A",0.91669999999999996,1.1777,1.6026,1333.9341999999999,38.813200000000002,13.7874,1339.0234,"N/A",41031111.960000001,1361031.0406000004,143767766.55200002,17869935,150511,3726715.9328900003,0,193615.98499999999,0,1386958.5071099997,1756881.51,207173684.56970999,4070842.9178899997,3920331.9178900006,193030465.50259998,18214061.984999999,19.423514752309273,0.64429173942974338,68.05751053619089,8.459359971372022,7.1249656400606626E-2,1.7641715869343684,0,9.1654911633800892E-2,0,0.65656541431181636,0.83168143141749729,98.072923845031227,1.9270761549687756,1.8558264985681692,91.377735460593584,8.6222645394064301,null,7767.090090779162,8499.980932585815,9219.6322885514019,{"$f":"1000*AX11/BP11","v":10555.159844160307},22520.312036045671,7386.6231745074219,null,1229.8120912483394,null,-1.7235319074989093]
[6,67,"HICC Miscellaneous",null,974.19999999999993,22156178.067555591,8884284.5922493301,2933143.3560000001,1221616.8711666667,7464.0036647152128,2947.1404965367747,5732.5722954346302,1760031.7648563723,199673.80340870231,37201.987919554587,1767894.6479196949,"N/A",5.0894230242425369,4.8249832923839708,3.9088251746769584,1200.0993822931116,68.07502367732971,12.683317316712353,1205.4607861585166,-1.1138221366906829,0.67376274391341262,0.66345026792767692,0.51746941895444731,158.87503336450212,"N/A",6.6478700649951463,6.3024554729983366,5.1057579109179665,1567.585307914728,88.920474859860931,16.567112836362348,"N/A","N/A",7.4691999999999998,"N/A",6.9668999999999999,"N/A",7.5194999999999999,"N/A",6.9676,"N/A",6.0011999999999999,"N/A",5.3730000000000002,"N/A",1682.99,"N/A",1656.1216999999999,"N/A","N/A","N/A",0.72719999999999996,"N/A",0.68940000000000001,"N/A",0.73070000000000002,"N/A",0.68930000000000002,"N/A",0.58430000000000004,"N/A",0.53169999999999995,"N/A",163.85830000000001,"N/A",163.88489999999999,"N/A","N/A",3.1897000000000002,3.0464000000000002,4.7750000000000004,1331.4716000000001,96.819100000000006,17.151199999999999,1338.8217,"N/A",39820.919000000002,1883420.037,0,0,114581,106486.09,307613,4420,260997,215805.31,0,2139046.2659999998,794097.09,679516.09,2245532.3560000001,687611,1.3576192557565536,64.211659929518959,0,0,3.9064234540604565,3.6304427392603715,10.487486040215213,0.15069157772184932,8.8982012920066769,7.357475711459907,0,72.926754896735432,27.073245103264565,23.16682164920411,76.557197635995806,23.442802364004194,null,7553.7317404664864,9866.7819273923633,8124.431231919476,"-",{"$f":"1000*AY12/BQ12","v":10271.008548239544},"-",null,1617.0165694925047,null,49.431261577776695]
[7,68,"HICC Oahu",null,2107.4,69408159.852448881,29143667.546432972,7536125.3420000002,3187234.6483333334,7869.4115877715822,3309.4643466727061,19550.872218118937,5939881.7837000201,681311.85711198102,162405.34977144655,5972208.387414271,"N/A",2.0884502925964159,2.0766995291063925,5.1885740565271332,1576.3755283092582,90.406120677813561,21.550245305281248,1584.9546328881299,-0.2758712077695164,0.22675753411416599,0.22711378665021636,0.56335947415062138,171.15802511771813,"N/A",2.1082593763637676,2.0963971561351622,5.2377880112394939,1591.3275503898319,91.263628478663207,21.754650751737234,"N/A",0.9758,2.3245,"N/A",2.0407999999999999,0.94989999999999997,2.3098000000000001,"N/A",2.0182000000000002,10.5067,3.9276,"N/A",5.3113999999999999,2046.3703,1459.4275,"N/A",1582.8812,"N/A","N/A",9.8000000000000004E-2,0.26350000000000001,"N/A",0.22520000000000001,9.7299999999999998E-2,0.26400000000000001,"N/A",0.22509999999999999,1.0550999999999999,0.44519999999999998,"N/A",0.58609999999999995,205.5078,165.41130000000001,"N/A",174.6788,"N/A","N/A",2.3759999999999999,2.4102000000000001,3.7587000000000002,1402.2669000000001,118.0077,19.4284,1410.7679000000001,"N/A",1497519.4,5646376.6260000002,0,0,0,179589.21824000002,70621,188,0,141831.09775999998,0,7285727.1237599999,250398.21824000002,250398.21824000002,7465316.3420000002,70809,19.871211425506569,74.924133686204286,0,0,0,2.3830444703343949,0.93709959422275224,2.4946506522688355E-3,0,1.882016173079728,0,96.677361284790578,3.3226387152094161,3.3226387152094161,99.060405755124989,0.93959424487502108,null,9210.0591089729369,9297.4171050136683,8027.6879621339294,{"$f":"1000*AX13/BP13","v":9957.6283722564294},8823.0217645348293,"-",null,1624.0616630032614,null,32.734112613429488]
[8,69,"MRO East",null,10323.199999999997,224479039.39370841,110800775.48873971,28629056.029999997,13447092.68233333,17598.096875219529,8484.758766741088,59760.099879991765,21794875.822559685,695782.65297970676,731606.85107204132,21915580.602332141,"N/A",1.2293871552578417,1.2619469452885215,4.1747866096157669,1522.5703425024653,24.303373895758408,25.55469695911037,1531.0026694116009,-0.36655068155245779,0.15679055757499613,0.15315341845424832,0.53243367435460154,194.18183436124005,"N/A",1.5919021365773152,1.6340629799655617,5.4058249227501145,1971.5375835455061,31.469820280154888,33.090126665803332,"N/A",1.6938,1.3588,0.64549999999999996,1.5928,1.7503,1.2403,0.59379999999999999,1.5747,6.1102999999999996,3.0768,3.8300000000000001E-2,5.5208000000000004,2182.9587000000001,1666.8258000000001,1091.6550999999999,2077.1174999999998,"N/A","N/A",0.16189999999999999,0.12959999999999999,7.0000000000000007E-2,0.154,0.16520000000000001,0.12330000000000001,6.4100000000000004E-2,0.1515,0.58409999999999995,0.29339999999999999,4.1000000000000003E-3,0.53380000000000005,208.6865,158.93620000000001,118.33580000000001,200.82050000000001,"N/A","N/A",1.6954,1.8106,4.7298,1738.9973,30.170100000000001,26.2563,1747.7702999999999,"N/A",18412861.649,286224.07999999996,2248935.4500000002,4515892,835402.01,1082174.7044250001,1168241,0,0,47076.136574999997,32249,25543238.315574992,3085817.7144249999,2250415.7044249997,22109521.02,6519535.0099999998,64.315294327921308,0.999767787313943,7.8554299787019577,15.773806845981433,2.9180214992928639,3.7799873781762274,4.0806130623930326,0,0,0.16443481938653359,0.11264430083271594,89.221378060137866,10.778621939862123,7.8606004405692582,77.227558592332684,22.77244140766733,null,7840.9514850395308,10153.048507502604,8659.4610609972588,{"$f":"1000*AX14/BP14","v":10460.46917265851},10487.389279471889,{"$f":"1000*AZ14/BR14","v":9225.0620691286986},null,2038.9402778009269,null,67.402694255420784]
[9,70,"MRO West",null,61555.1,1447090279.136142,627139932.5331136,203915893.01133332,87397461.78475,164050.94627819097,69021.424434164757,299484.95906038972,145305369.20201051,5627262.803120805,4947215.7132561076,146130871.24043989,"N/A",1.6090059862972357,1.5794835004283458,2.9373380822626198,1425.15001706056,27.595999115223702,24.261059989969244,1433.2465123973261,-0.36751917122926164,0.22673215160580465,0.22011490850335977,0.41391330365258328,200.82419362080478,"N/A",2.378002585561358,2.3343703378716039,4.3411880463930093,2106.2758338033714,40.785029891758377,35.856214256463517,"N/A",2.5005000000000002,9.4117999999999995,0.45800000000000002,2.3633000000000002,2.5004,8.9878,0.51780000000000004,2.3016000000000001,4.7535999999999996,0.81489999999999996,2.5100000000000001E-2,4.4187000000000003,2233.1185182348013,1853.4582,1019.1736708147628,2152.4612000000002,"N/A","N/A",0.2359,0.7772,5.3199999999999997E-2,0.22589999999999999,0.2379,0.76900000000000002,5.8099999999999999E-2,0.22239999999999999,0.44850000000000001,6.7299999999999999E-2,2.8999999999999998E-3,0.4224,210.7081259555564,153.06030000000001,118.8571,205.77160000000001,"N/A","N/A",2.5375999999999999,2.3879999999999999,4.9128999999999996,1965.2057,52.601500000000001,32.720100000000002,1976.4535000000001,"N/A",124049368.58600004,261301.36633333319,10199664.670000002,22092363,12826357.539999999,2641588.707901,31023440,0,0,294811.52809899993,526997.61300000001,157424506.76343238,46491386.247901008,33665028.707901001,137973732.47133338,65942160.539999999,60.833595044553775,0.12814173651428457,5.0018978508129921,10.834056469925148,6.2900234751624442,1.295430517401694,15.213841129232515,0,0,0.14457506168124659,0.25843871471592966,77.200704878203382,22.799295121796657,16.509271646634211,67.662078925679921,32.337921074320107,null,7096.5056120256158,10488.157805231529,9550.4224100896336,{"$f":"1000*AX15/BP15","v":10598.160408421181},12109.333380373617,8574.7815722810228,null,2158.16501263498,null,51.88917883160866]
[10,71,"NPCC Long Island",null,6031.1999999999989,114525698.26367985,62765614.456776217,12121635.85,6447770.3709999993,4376.5747337106122,2479.1389772088801,5949.9196604289627,7280232.7626313791,947931.12611743156,119618.6780496814,7308726.9345533121,"N/A",0.72210958782607093,0.76899108825563989,0.98170242598550972,1201.1964148603556,78.201584163034539,9.8681959704045568,1205.8977888786046,-0.38385908119818668,7.6429566465233759E-2,7.8996724517566813E-2,0.10390540726903201,127.13710325292466,"N/A",0.72526351988580529,0.77234978295764634,0.98599017234234176,1206.4428372133275,78.54314240789364,9.9112969348114959,"N/A","N/A",5.0358999999999998,0.5403,0.6069,"N/A",5.0168999999999997,0.5867,0.68259999999999998,"N/A",3.6438999999999999,0.1278,0.17979999999999999,"N/A",2130.9996000000001,1114.2099000000001,1129.2678000000001,"N/A","N/A","N/A",0.38329999999999997,5.8000000000000003E-2,6.4799999999999996E-2,"N/A",0.36399999999999999,6.0999999999999999E-2,7.0300000000000001E-2,"N/A",0.27729999999999999,1.37E-2,1.9199999999999998E-2,"N/A",162.1942,119.679,120.5622,"N/A","N/A",0.86880000000000002,1.26,0.36890000000000001,1303.4231,31.403300000000002,3.5649000000000002,1305.1876999999999,"N/A",0,350094.21399999998,10812614.365999999,0,0,478440.03729000007,0,52713,0,427774.23270999995,0,11590482.812709996,531153.03729000001,531153.03729000001,12068922.85,52713,0,2.8881763017159106,89.200950266130945,0,0,3.9469923301647452,0,0.43486704808080834,0,3.5290140539075838,0,95.618140621754421,4.3818593782455526,4.3818593782455526,99.565132951919196,0.43486704808080834,null,9448.0398257203742,9489.305689254601,10811.208654122105,"-",13138.568456825215,9309.9867144611853,null,1144.051570369051,null,-62.391266844276515]
[11,73,"NPCC NYC/Westchester",null,14988.499999999998,286393381.42128164,137666230.08011645,45503844.614000008,21508577.190000001,7583.6550797081927,3652.6531675310866,1458.4321391005826,15851201.707692493,1160746.9697483284,133430.32643884039,15882764.126133043,"N/A",0.33331931154559874,0.33964619186705824,6.410149082883744E-2,696.69725018424526,25.508766997485868,2.932286877530967,698.08449201878864,-8.4849973288017508E-2,5.2959709069203081E-2,5.3065347477088361E-2,1.0184817343632982E-2,110.69530747552817,"N/A",0.53096932824356813,0.54104789038443346,0.10211207195579146,1109.8212977943924,40.634827949726734,4.6710596705617302,"N/A","N/A",3.9348000000000001,0.46200000000000002,0.46250000000000002,"N/A",3.9354,0.46160000000000001,0.4622,"N/A",1.1529,1.72E-2,1.7399999999999999E-2,"N/A",2519.3204999999998,1077.0358503296973,1175.6081999999999,"N/A","N/A","N/A",0.252,4.6600000000000003E-2,4.6699999999999998E-2,"N/A",0.252,4.7699999999999999E-2,4.7699999999999999E-2,"N/A",7.3800000000000004E-2,1.6999999999999999E-3,1.8E-3,"N/A",161.34729999999999,108.66586945997864,118.60299999999999,"N/A","N/A",0.63190000000000002,0.81410000000000005,2.7E-2,1081.1058,22.504200000000001,2.3157999999999999,1082.2963,"N/A",0,82444.006999999983,28073491.607000001,16937052,1470,215746.94900000002,0,0,0,193640.05099999998,0,45286627.665000007,217216.94900000002,215746.94900000002,28565322.614,16938522,0,0.18118031058552517,61.694768530311677,37.22114503438911,3.2304962634909541E-3,0.4741290561932473,0,0,0,0.42554657225693721,0,99.522640447543267,0.47735955245673822,0.4741290561932473,62.775624469347385,37.224375530652601,null,6293.8282215645577,10025.910972240124,9115.3326644351328,"-",15614.271202554986,9911.4455687152713,null,1189.1031190405954,null,79.281821246202981]
[12,72,"NPCC New England",null,40761.899999999987,641715034.08506906,301610037.55375236,120324524.111,54178323.075833321,24559.207025244123,8725.8393647970915,60433.629603077083,38377520.494414218,8764225.4358079024,1288397.3435227764,38669246.449736267,"N/A",0.40821615055943422,0.32211552035612273,1.0045105941549661,637.90022487869146,72.838230614756952,10.707687007631321,642.74921069396771,-0.4122102320076052,7.6542408143077501E-2,5.7861730568181037E-2,0.18835036236681246,119.60922981688067,"N/A",0.6477679619924992,0.51114125166603319,1.5939834312873415,1012.2366007761996,115.58159111490443,16.991235111794147,"N/A",1.9467000000000001,4.5430000000000001,0.16719999999999999,0.28050000000000003,1.6934,4.3818000000000001,0.1681,0.25059999999999999,6.6109,5.6143999999999998,1.5800000000000002E-2,0.40329999999999999,2196.8413,2405.5756000000001,901.86509999999998,980.2731,"N/A","N/A",0.17780000000000001,0.31,2.1899999999999999E-2,3.5700000000000003E-2,0.15390000000000001,0.30080000000000001,2.1999999999999999E-2,3.2099999999999997E-2,0.60389999999999999,0.3831,2.0999999999999999E-3,5.1400000000000001E-2,200.6815,164.13579999999999,118.2821,124.8827,"N/A","N/A",0.61399999999999999,0.61819999999999997,1.3580000000000001,1079.7318,67.698899999999995,12.903700000000001,1085.1537000000001,"N/A",3545772.4300000006,408162.57999999996,62491490.386999995,36115946,7063168.3700000001,7289297.2582710003,1285106.3999999999,33129.21,0,2002401.5257289999,90049.95,104653822.872729,15670701.238271,8607532.8682710007,75827174.131000027,44497349.980000004,2.9468410169891941,0.33921811286240189,51.935788525829757,30.015448859521648,5.8700987368827571,6.0580312385416839,1.0680336444252068,2.7533215065482522E-2,0,1.6641674176760293,7.4839232205837311E-2,86.976303165084872,13.02369683491513,7.153598098032373,63.018885544104926,36.981114455895096,null,5333.2023444620781,8462.863629553618,8645.9677761611492,{"$f":"1000*AX18/BP18","v":10946.904921480056},14656.008012877144,7624.6963826310148,null,1056.8652597904556,null,44.628659014256073]
[13,74,"NPCC Upstate NY",null,28526.999999999989,256563726.3496342,129263410.61707936,82550859.975999996,35682466.057000048,11393.386698676426,5027.657713430478,26821.299746645793,16873346.370337673,1287300.1733751502,315913.74253054301,16935829.65225035,"N/A",0.27603314373681448,0.28179990168836283,0.64981272767948262,408.79880294992103,15.594024989556825,3.8268982615370524,410.3126159357783,-0.33819151015648535,8.8815257408212112E-2,7.7789340222873288E-2,0.2090809961973725,131.53337465439981,"N/A",0.72116221853164097,0.73622840914112353,1.6976960881561447,1068.0248309222347,40.740838237994524,9.9981270474400095,"N/A",2.8713000000000002,2.6766999999999999,0.19259999999999999,0.61209999999999998,2.5659999999999998,2.6152000000000002,0.20649999999999999,0.56579999999999997,7.6875,7.0593000000000004,2.7699999999999999E-2,1.2271000000000001,2126.8416999999999,2077.3512000000001,892.19179999999994,1085.6268,"N/A","N/A",0.2782,0.1973,2.5700000000000001E-2,7.6999999999999999E-2,0.24859999999999999,0.187,2.7300000000000001E-2,7.0800000000000002E-2,0.74480000000000002,0.52029999999999998,3.7000000000000002E-3,0.15429999999999999,206.07079999999999,153.10230000000001,118.8841,136.5033,"N/A","N/A",1.0062,1.3064,2.3801000000000001,1228.5589,38.997199999999999,13.0427,1233.4211,"N/A",4551039.0880000005,150223.90400000001,25095363.125000004,23837508,24141445,1485519.9369959999,2974614.7,0,0,315146.22200399998,0,53949280.339003995,28601579.636995997,4460134.636996001,31597292.276000012,50953567.700000003,5.5130123287911523,0.18197739435261437,30.399880912562239,28.876147391959666,29.244328898594926,1.7995208498468518,3.6033721524703792,0,0,0.38176007142217833,0,65.352778099087843,34.647221900912157,5.4028930023172324,38.276151556975044,61.723848443024977,null,3107.9473481466448,8119.8010294226797,9000.2139142423657,10320.927079430952,13568.386627764572,7504.7193022447909,null,1108.3796358595928,null,40.35480493735804]
[14,75,"RFC East",null,81434.799999999988,1391695054.7631896,678912553.31742406,262972202.97379991,119007154.76553342,104919.62657984624,50809.702243473919,185487.76348550199,112888707.89936092,6954055.6502328794,3020840.0766149666,113429807.07344979,"N/A",0.79795221999413724,0.85389323597524247,1.4107024346142185,858.56000461469387,26.444071166433194,11.487298058327234,862.67526218161447,-0.16451548684904282,0.15077962118317556,0.149679666387662,0.26656380340025643,162.23195952732624,"N/A",1.3980484624580416,1.4960596583931811,2.4716146158634844,1504.2360486049661,46.331211454784324,20.12626694410303,"N/A",2.6705999999999999,2.2286000000000001,0.33650000000000002,1.3536999999999999,2.6185,2.5901999999999998,0.37330000000000002,1.3675999999999999,4.2785000000000002,3.8776999999999999,0.1303,1.9384999999999999,2110.447534763945,2287.6941000000002,984.74706857320507,1469.4178999999999,"N/A","N/A",0.2596,0.1507,4.1500000000000002E-2,0.14910000000000001,0.25169999999999998,0.17549999999999999,4.5400000000000003E-2,0.14860000000000001,0.41589999999999999,0.26219999999999999,1.61E-2,0.2135,205.12577356086041,154.71600000000001,121.48241553491476,161.80330000000001,"N/A","N/A",1.4677,1.8030999999999999,2.5083000000000002,1492.0143,32.738500000000002,18.690100000000001,1498.4957999999999,"N/A",62720441.294000007,1064260.7518000002,80898350.963999987,107603742,2938775,3636571.9924650001,2003437,331843.24,0,1774780.731535,0,254061575.74133497,8910627.232464999,5971852.2324650008,150094405.73379996,112877797.24000001,23.850597357717266,0.40470465690475782,30.763080678933939,40.918295083347886,1.1175230563409746,1.3828731521206878,0.76184363873606964,0.12618947411451764,0,0.67489290178392825,0,96.611570678687784,3.3884293213122492,2.2709062649712757,57.076148747460572,42.92385125253945,null,5292.175519029458,9272.1314159531812,9221.1611258855664,10288.553691366234,14786.409291863802,8106.0873233145658,null,1500.2614611348974,null,-3.9745874700686272]
[15,76,"RFC Michigan",null,30753.899999999991,746347712.62259305,355576989.93620402,86819386.129999995,39850292.534916647,65732.867830825388,29263.658447930989,196167.89335118447,68119780.697311699,2635889.1814428014,2093695.9797297036,68471962.731619924,"N/A",1.5142440130226107,1.4686797303829227,4.5189882604663945,1569.2297246910216,30.360606068970846,24.115535401214242,1577.3427061346104,-0.2052536972942543,0.17614542583602621,0.16459815610217826,0.52567426692277153,182.54167473213104,"N/A",1.7475481283144378,1.6949636200316318,5.2152423311810354,1811.0056534449891,35.038355677176931,27.83108824684733,"N/A",2.2578,6.7609000000000004,0.48549999999999999,1.746,2.1855000000000002,6.1406999999999998,0.48099999999999998,1.6503000000000001,7.3719999999999999,30.601800000000001,0.13100000000000001,5.2944000000000004,2243.8348000000001,1521.1292000000001,931.85514455267435,1853.5527999999999,"N/A","N/A",0.20979999999999999,0.94750000000000001,6.2100000000000002E-2,0.1767,0.20069999999999999,0.94289999999999996,6.0499999999999998E-2,0.16600000000000001,0.68500000000000005,4.2885999999999997,1.67E-2,0.53580000000000005,208.46526712864389,213.00305432629702,119.12439999999999,187.5762,"N/A","N/A",1.8566,1.9121999999999999,5.6383999999999999,1856.2104999999999,33.909399999999998,28.7227,1865.8267000000001,"N/A",50853931.891000003,312669.353,21640806.765000004,10300505,-288332,1767956.83696,1578535,0,0,653313.28403999994,0,83761226.293039992,3058159.83696,3346491.83696,75228678.129999995,11590708,58.574396984163528,0.36013771455584931,24.926237940217518,11.864291443591206,-0.33210555021462923,2.0363618262777505,1.8181826322019401,0,0,0.7524970092068537,0,96.477561091734927,3.5224389082650611,3.8545444584796904,86.649631474421483,13.350368525578517,null,8596.5559754712012,9921.0531299361137,9895.7676933427592,10763.590649445359,7141.3492393860197,7822.5379901403439,null,1860.9534461115225,null,49.94779266653336]
[16,77,"RFC West",null,165405.00000000006,4024988554.1345425,1838224851.809664,567064674.15840018,248332717.14421669,341864.17783682782,152302.39738163119,961849.06112618896,391126291.35881823,9701816.8433324564,12286300.344541909,393132519.047755,"N/A",1.2057325854205254,1.2265995325391066,3.392378700202765,1379.4768363566359,17.108836585053108,21.666488681871115,1386.5526701384326,-0.10300412397701947,0.16987088198581762,0.16570594966300792,0.47793878078890922,194.34902042493815,"N/A",1.6889478575732708,1.7181775442021106,4.7519249351516457,1932.3227019894323,23.965457386903545,30.349656368969192,"N/A",1.9524999999999999,1.3594999999999999,0.1719,1.6892,1.9378,1.5948,0.21329999999999999,1.6720999999999999,5.6822999999999997,3.3694999999999999,1.06E-2,4.7439,2132.6906292745834,2342.7013999999999,945.28454664973503,1942.3954000000001,"N/A","N/A",0.1898,0.1244,2.1600000000000001E-2,0.17030000000000001,0.1865,0.1482,2.52E-2,0.1661,0.55230000000000001,0.30840000000000001,1.2999999999999999E-3,0.47820000000000001,207.48022523831102,203.83511378918445,118.73350000000001,195.7859,"N/A","N/A",1.6493,1.7673000000000001,5.7096999999999998,1791.7081000000001,21.758700000000001,27.846,1800.7972,"N/A",333072364.0126,2993909.3747999989,62665720.976000018,145877649,3788996,2838633.3342400002,11664541,77121,0,3759509.6627600002,326229.8,548695382.82616019,18369291.334240004,14580295.334240003,404825023.22839993,161408307,58.736221667647335,0.52796612295473366,11.05089486820958,25.725046127498938,0.66817704799251987,0.50058370122471685,2.0570036420116873,1.3600036030186129E-2,0,0.66297722889185706,5.7529557891111568E-2,96.76063557309358,3.2393644272591113,2.5711873792665907,71.389568364351817,28.463826853533334,null,7097.9356280801021,9942.5389320947852,9151.3643219455535,10279.006718953495,11493.11988719926,7961.3971343364346,null,1946.6089331052165,null,14.286231115784176]
[17,78,"SERC Midwest",null,38922.599999999969,1119689507.4612818,502786201.45580387,132935700.874,58080591.734833337,85901.124669414101,40059.737168716892,212369.3176469942,113709694.78604905,2603196.2617157386,3655614.0541920387,114303632.99329011,"N/A",1.292371035089114,1.3794534791108681,3.1950682360080758,1710.7472866724663,19.582371361498424,27.499114460282772,1719.6830082782676,-0.13851809467987294,0.15343740223873537,0.15935098080545967,0.37933608599853352,203.10933348633003,"N/A",1.5616459960097795,1.6668727043907372,3.8607840800115047,2067.1940007015369,23.662501711013608,33.228756158059575,"N/A",1.6712,29.111000000000001,0.36249999999999999,1.5633999999999999,1.7919,28.9877,0.38579999999999998,1.6380999999999999,4.2256,6.3212999999999999,2.3699999999999999E-2,3.8652000000000002,2175.4000442959423,2949.5160000000001,959.86159999999995,2069.7226000000001,"N/A","N/A",0.16089999999999999,1.6022000000000001,4.4999999999999998E-2,0.15359999999999999,0.17030000000000001,1.4346000000000001,4.6199999999999998E-2,0.15959999999999999,0.40679999999999999,0.34789999999999999,2.8999999999999998E-3,0.37980000000000003,209.42538302935569,162.33430000000001,119.2045,203.39619999999999,"N/A","N/A",1.2956000000000001,1.3815999999999999,3.3130000000000002,1917.9552000000001,23.289000000000001,28.842400000000001,1927.3853999999999,"N/A",100238039.65699999,90386.566999999981,9126340.1960000023,20092055,294171,129181.897,2535906,0,0,170137.557,259483,129976441.977,2959258.8969999999,2665087.8969999999,110013568.874,22922132,75.403401041235924,6.799269602201953E-2,6.8652289309778354,15.114115221044937,0.22128818523988761,9.7176225912738098E-2,1.9076184827156395,0,0,0.1279848497291641,0.19519436712185007,97.773917106131748,2.2260828938682651,2.0047947086283777,82.75697811099954,17.243021889000463,null,8422.7901165733747,10177.740063534136,9429.6510947598836,10387.47076800624,18169.394884506848,8052.2262162921706,null,2070.113653510602,null,2.9196528090651555]
[18,79,"SERC Mississippi Valley",null,52377.2,1305610342.5565579,632240710.44832492,182134134.31200001,85428713.960916668,89229.171580561699,43888.718465901024,134574.2197696013,95886176.444658071,3816210.1102413861,1931912.8573449517,96225693.143704116,"N/A",0.97981821933180357,1.027493366831671,1.4777484767250992,1052.9182440936943,20.952745209770121,10.607088367277383,1056.6464491369561,-8.0989760956785797E-2,0.13668576093819718,0.13883547117609468,0.20614760067860241,146.88329790173117,"N/A",1.3125373943248511,1.376401703682359,1.9795509991955531,1410.4601662564507,28.067718132797047,14.208962287365988,"N/A",2.0888,2.5095000000000001,0.8851,1.2474000000000001,2.0951,1.2841,0.94169999999999998,1.2715000000000001,5.9032,7.9931000000000001,1.03E-2,1.7843,2253.9061999999999,2450.3202000000001,1014.615,1384.4549,"N/A","N/A",0.1913,0.22,0.10489999999999999,0.13589999999999999,0.18990000000000001,0.2324,0.10970000000000001,0.13830000000000001,0.54069999999999996,0.7006,1.1999999999999999E-3,0.19439999999999999,206.43029999999999,214.78280000000001,120.23139999999999,150.8098,"N/A","N/A",1.3976999999999999,1.7022999999999999,1.2369000000000001,1301.6514999999999,27.4251,9.7475000000000005,1305.2492,"N/A",37499341.623999991,2318368.2370000002,97617480.599999994,38448397,1535177,3162179.2769999998,0,0,0,1304367.5739999996,248823,177436778.03500003,4697356.2769999998,3162179.2769999998,135964387.70639339,39983574,20.588859834347552,1.2728905791094498,53.596477655736393,21.109934799007529,0.8428826402030748,1.7361815724136109,0,0,0,0.71615767078870984,0.13661524839367037,97.420935787383328,2.5790642126166858,1.7361815724136109,74.650689844597295,21.952817439210602,null,7168.4000777142473,9602.5905355153864,8631.0803409327509,10918.485319257879,11408.363239514523,8438.8520802386065,null,1448.1647581429681,null,37.704591886517392]
[19,80,"SERC South",null,81805.299999999988,1800827396.5928469,896459626.46048057,254954509.91199997,120601841.82093334,96692.663561732916,45953.424708329985,274933.10668356664,146477427.18221283,5777614.3352629459,3948687.1657985966,147150138.64343181,"N/A",0.75850914420072291,0.76206837332651189,2.156722834818356,1149.0475476018912,22.661353734268694,15.487810618300198,1154.3246573219838,-8.5815308807644736E-2,0.107386930857088,0.10252201739362055,0.3053408752040736,162.67791956002793,"N/A",0.95875211417577366,0.96325096362970064,2.7260878703738847,1452.390882792407,28.643848223754173,19.576522297429094,"N/A",1.6718999999999999,4.0198999999999998,0.23069999999999999,0.94099999999999995,1.5793999999999999,3.9426000000000001,0.24490000000000001,0.91390000000000005,5.1372,29.382000000000001,0.26469999999999999,2.7071000000000001,2164.2280999999998,1115.4766,908.51319999999998,1518.9885999999999,"N/A","N/A",0.15570000000000001,0.70820000000000005,3.1099999999999999E-2,0.1043,0.1472,0.70179999999999998,3.2099999999999997E-2,9.9699999999999997E-2,0.4783,5.1765999999999996,3.5700000000000003E-2,0.3,201.51480000000001,196.52719999999999,122.5583,168.30699999999999,"N/A","N/A",1.4589000000000001,1.8026,4.6878000000000002,1696.7909999999999,28.167300000000001,24.834199999999999,1705.0811000000001,"N/A",86206870.777999997,488893.62399999995,106891573.50999999,48704611,4543110,7887727.3104820009,0,1547,0,230176.689518,0,242522125.60151801,12432384.310482003,7889274.3104820009,201705241.91199997,53249268,33.812647914231889,0.19175719785021508,41.925743359823159,19.10325532849404,1.7819296475940349,3.0937783031194575,0,6.0677491076112442E-4,0,9.0281473976454751E-2,0,95.123685274375774,4.8763147256242547,3.0943850780302182,79.114208249001166,20.885791750998838,null,7063.3282667344065,8928.0148573357965,10081.523644292871,10739.797275435847,5675.9400225515856,7412.9063474281211,null,1502.6473965936159,null,50.256513801208939]
[20,81,"SERC Tennessee Valley",null,69435.3,1614332664.1337109,753260138.03037834,229094795.21400002,102435265.10391663,110837.27112343589,51044.650556934772,259061.00881477181,153167116.44293475,3982959.3460394382,4761521.3689947408,153946973.32826239,"N/A",0.96761055631928738,0.99662260853529183,2.2616053636031319,1337.1505563874521,17.385638736658819,20.78406610917088,1343.9587152947652,-6.4388193482182457E-2,0.13731651918585663,0.13552993973743552,0.32095120735699179,189.75905009656464,"N/A",1.3678880301663496,1.4089016783718766,3.1971777133153978,1890.2979392559685,24.57766398822201,29.381939937765271,"N/A",1.7028000000000001,31.218499999999999,0.16300000000000001,1.3733,1.7022999999999999,31.2562,0.20430000000000001,1.3649,3.9952000000000001,2.3462999999999998,0.26050000000000001,3.1953,2181.8814000000002,2087.7811000000002,924.49630000000002,1912.5851,"N/A","N/A",0.16009999999999999,2.4380000000000002,2.1399999999999999E-2,0.13750000000000001,0.15870000000000001,2.4380000000000002,2.63E-2,0.13569999999999999,0.37569999999999998,0.1832,3.4200000000000001E-2,0.31990000000000002,205.19120000000001,163.04490000000001,121.34050000000001,191.4914,"N/A","N/A",1.2931999999999999,1.5145999999999999,2.9790999999999999,1743.9611,22.8415,26.107199999999999,1752.5340000000001,"N/A",122942268.12186466,1686474.0431094605,35575855.149025857,51180336,15809509,1829336.0100000002,47492,1400,0,22124.89,0,211407058.20400003,17687737.009999998,1878228.0100000002,162056058.21400002,67038737,53.66436544620008,0.73614681709992846,15.528879700559786,22.340243894319762,6.9008590898942774,0.79850614165686173,2.0730283267953422E-2,6.1110074486513078E-4,0,9.657526256470773E-3,0,92.279293384436045,7.7207066155639561,0.81984752566968033,70.737555631773148,29.262444368226859,null,7046.5706679444393,9961.5693601650801,9107.2554694362261,10633.406305923452,12804.945754206356,7619.0249751731699,null,1907.5548629751154,null,17.256923719146926]
[21,82,"SERC Virginia/Carolina",null,92484.999999999956,1584202044.5868838,770388018.74998748,289711035.65400016,133305343.94400001,96438.083536094709,46098.344891517416,155846.09181266013,135132027.14086312,6937947.1694596661,4229617.4685257198,135860466.29376376,"N/A",0.6657536073376924,0.6916203586089209,1.0758726636757188,932.87455782147242,23.947818051866022,14.599435119817533,937.90328688770387,-0.14010512201708583,0.12174972739824118,0.11967565374735564,0.19675027228398823,170.59948584538259,"N/A",1.149447177924753,1.194107039956434,1.8575322513290826,1610.640957896894,41.34675587752448,25.20644171178748,"N/A",1.5513999999999999,85.386399999999995,0.29120000000000001,1.1051,1.5466,55.338299999999997,0.36259999999999998,1.117,2.4539,20.255700000000001,0.3619,1.7142999999999999,2038.8289,10063.301799999999,988.47969999999998,1665.7112,"N/A","N/A",0.15390000000000001,1.3803000000000001,3.5799999999999998E-2,0.1176,0.15160000000000001,1.2588999999999999,4.2200000000000001E-2,0.11609999999999999,0.24340000000000001,0.32750000000000001,4.4400000000000002E-2,0.1825,202.24440000000001,162.6823,121.3472,177.32069999999999,"N/A","N/A",1.6037999999999999,1.8496999999999999,3.3203,1790.5746999999999,53.104799999999997,29.940300000000001,1800.9713999999999,"N/A",100678330.67699997,583033.26000000013,58544567.688999988,119254284,2547657,7052583.2493099999,0,110025,0,629520.77868999995,311034,280000770.40469009,9710265.2493100017,7162608.2493099999,167799069.65400004,121911966,34.75129293909238,0.20124647950805458,20.207917712502795,41.163183076817461,0.87937865198985676,2.4343509156940955,0,3.7977497043434026E-2,0,0.21729264722999098,0.10736008012185828,96.648292935272593,3.3517070647273868,2.4723284127375291,57.919460774149208,42.080539225850757,null,5468.2143571461493,9441.0657213624127,10097.945135565109,10081.015345789549,61858.615227348018,8145.8797565992454,null,1674.0963824579878,null,63.455424561093878]
[22,83,"SPP North",null,23788.500000000007,603772956.24710608,294874949.96850938,69447958.949000001,33693380.269833341,47993.455492390931,23430.369615137253,59998.414151775272,59782627.679468192,1403934.8903058483,1885096.303898429,60089349.789690264,"N/A",1.3821415695639245,1.3907995830335338,1.7278668821883123,1721.652546286359,20.215639329830353,27.144013048429162,1730.4856960250668,-0.23521209618263678,0.15897848684944627,0.15891732829553309,0.19874495381412788,198.03016038035651,"N/A",1.7128995385040628,1.7236294865810424,2.1413597928543666,2133.6583147041047,25.053409897479728,33.639801050533535,"N/A",1.7762,60.82,1.2016,1.7148000000000001,1.8028,47.316299999999998,1.1808000000000001,1.7058,2.3856999999999999,4.3532999999999999,0.30359999999999998,2.1436999999999999,2259.1567269175866,5101.8825999999999,1197.8106,2149.6743000000001,"N/A","N/A",0.16320000000000001,1.8298000000000001,0.121,0.15920000000000001,0.1658,1.7265999999999999,0.1186,0.15909999999999999,0.21920000000000001,0.13100000000000001,3.0599999999999999E-2,0.19900000000000001,207.59688853543207,153.4939,120.5938,199.52440000000001,"N/A","N/A",2.0950000000000002,2.4636,3.0002,2112.0799000000002,26.1142,30.63,2122.1235999999999,"N/A",49086801.636,63718.691999999988,6806750.6640000008,8284924,68118,60642,5057240,0,0,19763.957000000002,0,64261958.949000001,5186000,5117882,56037676.949000001,13410282,70.681417249494004,9.1750273102759766E-2,9.8012249272849417,11.929686812083476,9.8084956031642814E-2,8.732006083077723E-2,7.2820570633527888,0,0,2.8458657819611252E-2,0,92.532537919784787,7.467462080215209,7.3693771241835666,80.690171168532089,19.309828831467907,null,8693.8905820183209,10774.410880675892,10585.571990192679,10882.420940196318,33238.341067625486,9932.6051588058435,null,2149.7578663203294,null,16.099551616224744]
[23,84,"SPP South",null,50658.899999999972,1377387399.8837769,674580693.21287084,152734002.21469998,72368110.325450003,125199.34430451621,59060.997802457488,194323.78657398594,117500298.97706056,3627540.2247456317,3050862.7436236865,118011271.87468208,"N/A",1.6394429857016648,1.6322382203114472,2.5446041321018051,1538.6265962164603,23.75070496513511,19.975006870670832,1545.3176131506361,-0.14908271681371868,0.18179249253344479,0.17510432301631315,0.2821628636800117,170.61329149224852,"N/A",1.8158041797158042,1.8078243699733938,2.8183369956077104,1704.1425830590945,26.305659741153775,22.1237952658003,"N/A",2.3818000000000001,19.8901,1.0102,1.8243,2.323,19.736799999999999,1.0722,1.7605,4.8106,0.47720000000000001,3.0599999999999999E-2,2.8168000000000002,2190.5681,1387.7661000000001,1085.2797,1729.3628000000001,"N/A","N/A",0.22389999999999999,2.0971000000000002,0.11,0.18190000000000001,0.2177,2.0916999999999999,0.1149,0.17510000000000001,0.4521,5.0299999999999997E-2,3.3E-3,0.28079999999999999,205.87639999999999,146.3168,118.18680000000001,172.42,"N/A","N/A",1.8101,2.2179000000000002,1.8,1590.1257000000001,27.598700000000001,16.188700000000001,1595.7237,"N/A",73928246.26699999,1171209.8199999996,60177365.072700001,0,3058758,2288313.6869999995,11658048,117586,0,304972.81799999997,29502.55,135611296.52770001,17122705.686999999,14063947.686999999,137899610.21469998,14834392,48.403266590944291,0.76682978447301875,39.400110126170844,0,2.0026699724009509,1.4982346129994617,7.6329093921156765,7.6987441103460369E-2,0,0.19967578507587072,1.9316294716436436E-2,88.789198581380461,11.210801418619548,9.2081314462185979,90.287433194379901,9.7125668056200869,null,9018.2106139506996,9988.3342508313272,9222.3970537060668,10640.209854067782,9484.6668325168412,9182.7488348952666,null,1722.1885915283372,null,18.046008469242679]
[24,85,"WECC California",null,95000.900000000009,1117751448.1194241,505875672.1784246,206633043.97209996,95040986.043333381,34618.617883493091,15715.992143257361,20665.186198461884,67187988.144897401,6429630.7934280355,1172434.912847518,67437084.358907878,"N/A",0.33507339598759789,0.33072030915360551,0.20001821394309172,650.31213646515573,31.116179047801175,5.6739952638253861,652.72313723465618,-0.522709233352743,6.1943320121369827E-2,6.2133812743279178E-2,3.6976353254975079E-2,120.21990802684931,"N/A",0.49276650710417891,0.48636475924835387,0.29415130482517265,956.3637216523507,45.760155976037986,8.3443056385902299,"N/A",3.2086000000000001,0.92930000000000001,0.20660000000000001,0.46210000000000001,3.0796999999999999,0.95220000000000005,0.222,0.47320000000000001,1.89,2.6882000000000001,8.6999999999999994E-3,0.19009999999999999,1960.134,1514.0219,885.10445386850347,986.41390000000001,"N/A","N/A",0.33600000000000002,9.2799999999999994E-2,2.7400000000000001E-2,5.9799999999999999E-2,0.32179999999999997,9.6600000000000005E-2,2.8799999999999999E-2,5.9900000000000002E-2,0.19789999999999999,0.26840000000000003,1.1999999999999999E-3,2.46E-2,205.2372,151.1474,118.0569355884503,127.62990000000001,"N/A","N/A",0.35139999999999999,0.4355,0.27900000000000003,1018.8726,37.614400000000003,6.0365000000000002,1021.5339,"N/A",11013736.158,1700916.6479999998,121058637.44610001,18507408,26319800,5895891.836569,10334181,1804319.96,9160148,180820.86243099999,657184.06099999999,153118703.17553103,53514340.796569005,27194540.796569016,140507187.01210001,66125856.960000001,5.3300943287110929,0.82315810448480897,58.586291485134197,8.9566545815871113,12.737459359865868,2.8533150958009776,5.0012238126808715,0.87320010648617419,4.4330508924975343,8.7508202441916705E-2,0.3180440303094671,74.101750732668606,25.898249267331426,13.160789907465565,67.998411246882469,32.001588753117559,null,5409.3547993724833,7955.1193920291553,7983.0243540110896,9550.5785500874117,10016.857054769052,7497.267733206304,null,1015.3110924927419,null,58.947370840391159]
[25,86,"WECC Northwest",null,80235.000000000044,1056452192.2743175,415952620.59163451,287596498.2719999,123371655.51725005,104109.14917166656,41249.740534728131,109096.30353350789,95734309.73754479,3622959.421116367,2983818.7576152999,96234699.422699004,"N/A",0.72399455346082375,0.66870693048226981,0.75867616044704389,665.75434897682396,12.597369727672707,10.375017691603798,669.23415271686099,-0.21962019836647431,0.19709202164187223,0.19833864960896813,0.20653334685906929,181.23737247674052,"N/A",1.9642092624522443,1.8142130219635102,2.0583010389075045,1806.2026192423582,34.17687354600956,28.147595517867106,"N/A",2.6667000000000001,1.7021999999999999,0.42549999999999999,1.9804999999999999,2.6612,2.3275999999999999,0.5222,2.0194999999999999,2.5049999999999999,47.125300000000003,1.6899999999999998E-2,1.9581,2276.5871999999999,1817.5604000000001,907.4951556879771,1858.748,"N/A","N/A",0.24379999999999999,0.20660000000000001,5.5599999999999997E-2,0.19950000000000001,0.24279999999999999,0.27329999999999999,6.5699999999999995E-2,0.20100000000000001,0.22900000000000001,5.7188999999999997,2.2000000000000001E-3,0.1973,208.1173,220.5718,118.60404422988316,187.25040000000001,"N/A","N/A",1.5959000000000001,1.5029999999999999,1.6176999999999999,1579.0663,38.297899999999998,22.841100000000001,1586.9512999999999,"N/A",70471699.594999999,995845.63499999978,30654143.414000008,9333709,150176172.73000002,3158439.718225,20206458.890000001,11595,1862394,383232.567775,342807.72199999995,112181437.93377501,175415060.33822501,25238887.608225003,106006168.65200001,181590329.62,24.503670948159474,0.34626486796030442,10.658733189792967,3.2454181661045349,52.21766385624349,1.0982191150456377,7.0259752853073181,4.0316902568938119E-3,0.64757186238012021,0.13325355839783226,0.11919746035147584,39.006538190766584,60.993461809233459,8.7757979529899703,36.859339139707693,63.14066086029235,null,3673.3833639210643,9965.9501490188559,8432.912826888487,10938.961825854938,8240.2210980732816,7651.4688987251839,null,1866.1281517838404,null,59.925532541482198]
[26,87,"WECC Rockies",null,19921.200000000004,592852748.91324484,261308146.94372991,63636839.61666666,27741776.575583335,62952.609859472992,27836.572841019832,51254.955720533428,57993856.104248703,1378226.1332668972,1790072.346391195,58285775.911742903,"N/A",1.9784957970472667,2.0068341885155205,1.6108579882118979,1822.6504161297148,21.657677244329022,28.129497900495522,1831.8249700281376,-0.25357953187501908,0.21237182411609318,0.21305552977660633,0.17290956587276896,195.64337421242266,"N/A",2.2687027021654251,2.3011977852457122,1.847139567400246,2089.9978308509053,24.834437839173258,32.255548883476465,"N/A",2.5388999999999999,32.616700000000002,1.0933999999999999,2.2732999999999999,2.5257000000000001,33.212899999999998,1.4298999999999999,2.2827000000000002,2.2528999999999999,6.3411999999999997,7.1099999999999997E-2,1.8509,2347.0504999999998,5640.9519,974.98561113158621,2094.7134999999998,"N/A","N/A",0.22559999999999999,0.94269999999999998,0.13289999999999999,0.21249999999999999,0.223,0.94379999999999997,0.16750000000000001,0.2132,0.20019999999999999,0.18329999999999999,8.6E-3,0.1731,208.57939999999999,163.03210000000001,118.51448395012088,195.84899999999999,"N/A","N/A",2.2328000000000001,2.5369999999999999,1.5146999999999999,1669.5826999999999,22.8933,20.664000000000001,1676.4693,"N/A",44777830.298,26126.380666666664,10579256.439999999,0,2018806,57989.498,5958128,163335,0,0,55368,55438581.118666664,8198258.4979999997,6179452.4979999997,55496570.61666666,8140269,70.364635591162468,4.1055433965680621E-2,16.624421488758635,0,3.1723857001083209,9.1125672408175956E-2,9.3627025413115437,0.25666736592183331,0,0,8.700620636336405E-2,87.117118720250133,12.882881279749872,9.7104955796415506,87.208244392658301,12.791755607341697,null,9316.1878007212526,10682.691602842939,8524.8466931156145,11252.551786034479,34600.252956319644,8226.7211452562024,null,2092.1944677251868,null,2.1966368742814666]
[27,88,"WECC Southwest",null,63160.500000000007,1202106279.302022,579100917.15073109,177873710.92200002,84358855.756916717,115206.6071541312,52010.91979323094,39065.155950119974,102534225.30804379,3317864.6253200048,2686986.1065182555,102985545.73311999,"N/A",1.2953753149575975,1.2330873700587501,0.43924597679586908,1152.8879088040887,18.652922953718171,15.106145211624524,1157.9625252017204,-0.15138830724574182,0.19167457842583357,0.17962644593668736,6.4994512752736544E-2,170.59094869311915,"N/A",1.8068350394165478,1.719953623600647,0.61267573392310881,1608.0885949375099,26.017752840549093,21.07058252825448,"N/A",3.1324999999999998,13.1631,0.32700000000000001,1.806,3.1821000000000002,12.829700000000001,0.33050000000000002,1.6803999999999999,1.1309,32.854799999999997,1.8599999999999998E-2,0.60519999999999996,2216.8903,6474.2822999999999,941.54700000000003,1613.8556000000001,"N/A","N/A",0.29199999999999998,0.33589999999999998,4.1300000000000003E-2,0.19209999999999999,0.29380000000000001,0.3417,4.1300000000000003E-2,0.1799,0.10539999999999999,0.83830000000000005,2.3E-3,6.4399999999999999E-2,206.6463,165.19149999999999,118.86450000000001,171.6695,"N/A","N/A",1.0308999999999999,1.1601999999999999,0.32529999999999998,1236.0239999999999,21.557200000000002,10.5235,1239.7389000000001,"N/A",66459450.053999998,89144.858999999997,60369815.680000015,31933916,11258534,585343.43199999991,1729605,1167442,4261109,7421.8969999999999,11929,158871677.49000001,19002033.432,7743499.432,127523104.92199998,50350606,37.363278535940225,5.0116938887664636E-2,33.939706641906731,17.953139806029821,6.3295098199963995,0.32907810207922222,0.97237809400538944,0.65633195256826837,2.3955810995974289,4.1725654463096009E-3,6.7064435425373365E-3,89.31712093175328,10.682879068246709,4.353369248250309,71.693059227802664,28.306940772197308,null,6758.200934083854,9426.5763058176399,7200.0209705276711,10727.945770139604,39192.587390997724,7921.1791577804979,null,1618.2556411315613,null,10.167046194051409]
[28,53,"ASCC","Alaska Systems Coordinating Council",2762.0000000000005,55212470.126647115,21979611.396476645,6928294.4960000003,2577024.1403333331,11728.385487278965,4818.8578878452336,2384.2516613235989,3766232.7197810858,170189.68990352436,46156.740539509839,3775174.0063086967,"N/A",3.3856486597243407,3.7398624346777942,0.68826510267429575,1087.2034154886148,24.564442230592551,6.6620638839988819,1089.784508579497,-1.9576246373231534,0.42484552712009571,0.43848435724552448,8.6366418885247126E-2,136.42688730071487,"N/A",4.3976101139736556,4.8576974519701857,0.89398572646401953,1412.1656487205353,31.906689221016439,8.6533372067606873,"N/A",6.2821999999999996,10.129300000000001,2.3917999999999999,4.3975999999999997,6.024,10.2376,2.6417000000000002,4.7388000000000003,3.5739999999999998,2.0779000000000001,3.8399999999999997E-2,0.89400000000000002,2165.0120000000002,1397.8608999999999,1271.2256,1412.1656,"N/A","N/A",0.61680000000000001,1.1718,0.22,0.42480000000000001,0.60770000000000002,1.133,0.22800000000000001,0.4385,0.35089999999999999,0.2404,3.5000000000000001E-3,8.6400000000000005E-2,212.5771,161.70419999999999,116.92400000000001,136.42689999999999,"N/A","N/A",8.4473000000000003,7.0044000000000004,0.59370000000000001,1387.6247000000001,38.613999999999997,6.0785999999999998,null,"N/A",684959.15500000003,1037761.591,3608695.378,0,1575045,2565.3719999999998,19268,0,0,0,0,5331416.1239999998,1596878.372,21833.371999999999,5333981.4960000003,1594313,9.8864035787661173,14.978601033762983,52.086345060583866,0,22.733516898124648,3.7027467603767399E-2,0.2781059611586118,0,0,0,0,76.951349673112972,23.048650326887024,0.31513342876237915,76.988377140716736,23.011622859283261,null,7969.1286446503727,10351.080176796906,10171.195709936972,10184.596553438729,8644.5553053043768,10872.238377065445,null,1412.1657801718536,null,1.3145131833880441E-4]
[29,54,"FRCC","Florida Reliability Coordinating Council",80756.100000000006,1640755276.180264,784793331.4321754,211244527.48759997,99311487.290116638,65764.227954776434,32261.830247811431,134754.30225533311,118861947.31040302,8459346.3787531853,2503826.0785921579,119338507.31879841,"N/A",0.62263603925679722,0.64970994047376607,1.2758134268187673,1125.3493638303146,40.045280601409893,11.852738191000627,1129.8612914439032,-7.4046888627295609E-2,8.0163360020243685E-2,8.2217391396373282E-2,0.16425886810986934,144.88686891456209,"N/A",0.68138703166408343,0.71101558514103469,1.3961972469420176,1231.5356231558383,43.823892548397986,12.971144591465709,"N/A",1.5429999999999999,15.084899999999999,0.32079999999999997,0.59789999999999999,1.5943000000000001,20.3413,0.34399999999999997,0.63190000000000002,3.2294,0.8357,0.12959999999999999,0.82979999999999998,2171.2136309231232,3655.6637000000001,900.95851555787772,1216.7134000000001,"N/A","N/A",0.1462,0.66979999999999995,4.1200000000000001E-2,7.1099999999999997E-2,0.15240000000000001,0.65969999999999995,4.36E-2,7.4499999999999997E-2,0.30599999999999999,3.7100000000000001E-2,1.67E-2,9.8699999999999996E-2,205.70163436457645,162.32740000000001,121.97163633136846,144.6841,"N/A","N/A",0.91669999999999996,1.1777,1.6026,1333.9341999999999,38.813200000000002,13.7874,null,"N/A",41031111.960000001,1361031.0406000004,143767766.55200002,17869935,150511,3726715.9328900003,0,193615.98499999999,0,1386958.5071099997,1756881.51,207173684.56970999,4070842.9178899997,3920331.9178900006,193030465.50259998,18214061.984999999,19.423514752309273,0.64429173942974338,68.05751053619089,8.459359971372022,7.1249656400606626E-2,1.7641715869343684,0,9.1654911633800892E-2,0,0.65656541431181636,0.83168143141749729,98.072923845031227,1.9270761549687756,1.8558264985681692,91.377735460593584,8.6222645394064301,null,7767.090090779162,8499.980932585815,9219.6322885514019,10555.159844160307,22520.312036045671,7386.6231745074219,null,1229.8120912483394,null,-1.7235319074989093]
[30,55,"HICC","Hawaiian Islands Coordinating Council",3081.5999999999995,91564337.920004472,38027952.138682306,10469268.697999999,4408851.5195000004,15333.415252486795,6256.6048432094831,25283.444513553561,7699913.5485563921,880985.66052068339,199607.33769100119,7740103.0353339668,"N/A",2.9292237490123871,2.8382016566160218,4.83003068177696,1470.9553781970174,84.149684752000198,19.066024900968802,1478.6329892961103,-0.51063738587789576,0.33492111887234727,0.32905294612723673,0.5522552794657356,168.18586195170113,"N/A",3.1579969432836066,3.0598660000069398,5.2072574292627625,1585.8374047455254,90.721798672666679,20.555086779604686,"N/A",0.9758,3.6080999999999999,"N/A",3.1581999999999999,0.94989999999999997,3.5396999999999998,"N/A",3.0832000000000002,10.5067,4.4450000000000003,"N/A",5.3254000000000001,2046.3703,1515.2048,"N/A",1599.4947,"N/A","N/A",9.8000000000000004E-2,0.39290000000000003,"N/A",0.3397,9.7299999999999998E-2,0.38840000000000002,"N/A",0.3347,1.0550999999999999,0.48399999999999999,"N/A",0.57269999999999999,205.5078,164.97800000000001,"N/A",172.0179,"N/A","N/A",2.5678999999999998,2.5621999999999998,3.9984000000000002,1385.5681,113.0098,18.891200000000001,null,"N/A",1537340.3189999999,7529796.6629999997,0,0,114581,286075.30824000004,378234,4608,260997,357636.40775999997,0,9424773.3897599988,1044495.30824,929914.30824000004,9710848.6979999989,758420,14.684314285425554,71.922852304272766,0,0,1.0944508475734225,2.7325242716776441,3.612802488031051,4.4014535617758012E-2,2.4929821511779489,3.41605911622386,0,90.023225705922172,9.9767742940778241,8.882323446504401,92.75574997759982,7.2442500224001805,null,8746.0108782475418,9429.0767746039164,8054.7902282262476,9957.6283722564294,9184.2839651347458,"-",null,1621.9699857061391,null,36.132580960613723]
[31,56,"MRO","Midwest Reliability Organization",72028.200000000055,1671569318.5298507,737940708.02185321,232544949.04133332,100844554.46708335,181649.0431534104,77506.183200905885,359245.05894038163,167100245.02457026,6323045.4561005114,5678822.564328148,168046451.84277201,"N/A",1.5622703817241241,1.5371416654174355,3.0896827509810003,1437.1436207360437,27.190637690335869,24.420322125847488,1445.2814609437323,-0.36867711104213813,0.21733952775966381,0.21006073349353871,0.42982968753738376,199.93217531838326,"N/A",2.2694321759676708,2.2329289445204821,4.4882278577606565,2087.6667781320025,39.498481684986693,35.474182592344619,"N/A",2.3950999999999998,6.0105000000000004,0.49049999999999999,2.2599,2.3940999999999999,5.6246999999999998,0.53310000000000002,2.1934,4.9307999999999996,1.7702,2.7400000000000001E-2,4.5666000000000002,2226.1159863320281,1653.333670784187,1030.8127553895054,2142.3525,"N/A","N/A",0.22639999999999999,0.52610000000000001,5.6300000000000003E-2,0.21640000000000001,0.22750000000000001,0.51219999999999999,5.9299999999999999E-2,0.21190000000000001,0.46600000000000003,0.155,3.0999999999999999E-3,0.43719999999999998,210.44704160976411,155.33860000000001,118.7612,205.1138,"N/A","N/A",2.3965999999999998,2.2883,4.8822999999999999,1927.3329000000001,48.845999999999997,31.637899999999998,null,"N/A",142462230.23500001,547525.44633333338,12448600.119999999,26608255,13661759.549999999,3723763.4123260011,32191681,0,0,341887.66467399994,559246.61300000001,182967745.07900739,49577203.962325998,35915444.412325993,160083253.49133334,72461695.549999997,61.262233741175905,0.23544929640076354,5.3532016805006348,11.442198641463746,5.8748898250942929,1.6013090921463646,13.843208004607376,0,0,0.14702003465714134,0.24048968395378809,78.680593078151986,21.319406921848035,15.444517096753739,68.83970352883459,31.160296471165417,null,7188.1557755646645,10441.874974888282,9396.4077502342607,10578.034118721216,10643.418125206401,{"$f":"1000*AZ37/BR37","v":8679.7098327526601},null,2141.7726552242398,null,54.105877092237279]
[32,57,"NPCC","Northeast Power Coordinating Council",90299.400000000067,1299197840.1196647,631305292.70772457,260500864.55099994,117817136.69383337,47912.823537339355,19885.289222967527,94663.281149252318,78382301.335075796,12160203.705048807,1857360.0905418417,78796567.162673011,"N/A",0.36785155104895362,0.33756191638984784,0.72677901712467818,601.78150633147231,46.680089626605152,7.1299574907100327,604.96203955781107,-0.32987222575292657,7.3757548015822239E-2,6.2997378455921862E-2,0.14572573664459479,120.66261028860127,"N/A",0.64721383742801508,0.59392095168073278,1.2787262559967449,1058.8002603098209,82.130957046578274,12.544753814690184,"N/A",2.4605999999999999,4.452,0.26979999999999998,0.41749999999999998,2.2330999999999999,4.4587000000000003,0.27939999999999998,0.40360000000000001,7.2092000000000001,5.0324,2.81E-2,0.4849,2157.94,1921.5678978262547,956.14705912931856,1056.0141000000001,"N/A","N/A",0.2321,0.31990000000000002,3.27E-2,4.9599999999999998E-2,0.21099999999999999,0.31530000000000002,3.39E-2,4.8000000000000001E-2,0.68020000000000003,0.36159999999999998,3.3999999999999998E-3,5.7599999999999998E-2,203.59800000000001,161.80950000000001,115.96680468063006,125.3531,"N/A","N/A",0.74480000000000002,0.89390000000000003,1.2786,1141.3116,48.320900000000002,10.0542,null,"N/A",8096811.5180000011,990924.70500000019,126472959.485,76890506,31206083.370000001,9469004.1815569997,4259721.0999999996,85842.209999999992,0,2938962.0314430003,90049.95,215480213.68944296,45020650.861557014,13814567.491556998,148058711.87099999,112442152.68000001,3.1081706895505659,0.38039209839397686,48.549919288363654,29.516411061640316,11.979262880292891,3.6349223630707725,1.6352042083783742,3.2952754359551889E-2,0,1.1281966516727704,3.4568004277149081E-2,82.717657793898425,17.282342206101596,5.3030793258086977,56.836169095328884,43.16383090467113,null,4987.3072105114352,8774.8827725289466,9104.7736354346252,10599.023566046817,11875.494935873694,8245.0065064957671,null,1099.9587576730983,null,41.15849736327732]
[33,58,"RFC","Reliability First Corporation",279506.7000000003,6163031321.5203304,2872714395.0632896,916856263.26219988,407190164.44466621,512516.67224749923,232375.75807303606,1343504.7179628741,572134779.95549107,19291761.675008137,17400836.400886573,575034288.85282457,"N/A",1.1179869577897648,1.1413623331985663,2.9306768613493404,1248.0359307789854,21.041206182490935,18.978805182585454,1254.3608238151457,-0.13151679803218655,0.16631967144410642,0.16178131628564943,0.43598828169883486,185.66667930363647,"N/A",1.626654643501168,1.6606654722388146,4.2640918947211865,1815.8739937999344,30.614646712229931,27.613883474445746,"N/A",2.0878000000000001,1.8285,0.29470000000000002,1.6173999999999999,2.0695999999999999,1.98,0.3301,1.5947,5.68,4.9519000000000002,8.5699999999999998E-2,4.1528999999999998,2142.2563094730876,2286.9515999999999,963.07181371526497,1821.3166000000001,"N/A","N/A",0.2019,0.159,3.6799999999999999E-2,0.16639999999999999,0.1981,0.1764,3.9899999999999998E-2,0.16200000000000001,0.54920000000000002,0.43059999999999998,1.0699999999999999E-2,0.42720000000000002,207.27085755175079,189.04515979507647,120.16128190941531,187.37700000000001,"N/A","N/A",1.6287,1.7931999999999999,4.9065000000000003,1724.9323999999999,25.921900000000001,25.676500000000001,null,"N/A",446646737.19759989,4370839.4795999974,165204878.70499986,263781896,6439439,8243162.1636649976,15246513,408964.24,0,6187603.6783350017,326229.8,886518184.86053479,30338078.403664999,23898639.403664999,630148107.09220004,285876812.24000001,48.715022746141088,0.47672025100733129,18.0186235645265,28.770256208040369,0.70233898791161642,0.89906809758114092,1.662912019137273,4.4605054945569544E-2,0,0.67487172485677716,3.5581346070458784E-2,96.691075840642526,3.3089241595756,2.6065851716639838,68.729214419075419,31.180112270034826,null,{"$f":"F39*1000000/(H39*1000)","v":6721.9165843859701},{"$f":"(F39*((CT39+CU39+CV39+DC39)/DH39)*1000000/((CD39+CE39+CF39+CM39)*1000))","v":9780.2901447398763},{"$f":"1000*BY39/BS39","v":9205.6783916916156},10335.54033971329,12097.382458662461,8014.8263934241777,null,{"$f":"DL39*BS39/1000","v":1832.6014264509238},null,{"$f":"DR39-AH39","v":16.727432650989385}]
[34,59,"SERC","SERC Reliability Corporation",333238.60000000003,7424661955.3312855,3555134695.1449738,1088830175.9659994,499851756.56459999,479098.31447123911,227044.87579140006,1036783.7447275947,644372441.99671745,23117927.222719181,18527352.914856076,647486904.40245271,"N/A",0.88002394688627694,0.90844884632132783,1.904399359262376,1183.6050400146864,21.231894314656724,17.015833436484982,1189.3257896310758,-0.10137944597472928,0.12905592668154328,0.12772786139521586,0.27928106382894136,173.57623710639788,"N/A",1.2323464920729184,1.2721514601425394,2.666836372119977,1657.4679862097178,29.732202823920865,23.82821821990618,"N/A",1.6886000000000001,3.0430999999999999,0.45400000000000001,1.2124999999999999,1.6927000000000001,1.75,0.49440000000000001,1.2141,4.0933000000000002,12.5303,0.19170000000000001,2.6013000000000002,2125.8347375716457,2175.5454,962.17536829079927,1688.1177,"N/A","N/A",0.1608,0.2964,5.7200000000000001E-2,0.12759999999999999,0.1598,0.31119999999999998,6.0499999999999998E-2,0.1265,0.38979999999999998,1.2204999999999999,2.4199999999999999E-2,0.27379999999999999,204.89715376673271,175.08399559708351,121.2646,177.6891,"N/A","N/A",1.4155,1.6727000000000001,3.1579999999999999,1670.6454000000001,30.916899999999998,23.4971,null,"N/A",447564850.85786474,5167155.7311094617,307755817.14402586,277679683,24729624,20061007.743792001,2583398,112972,0,2356327.4892080002,819340,1041343174.2222079,47487001.743791983,22757377.743792009,777538326.36039305,305105677,41.105110855399431,0.47456029830595137,28.264813369172835,25.502570476947458,2.2712103821020686,1.8424367901077021,0.23726362999703191,1.0375539041225814E-2,0,0.21640909126324404,7.5249567663119701E-2,95.638713658752025,4.3612863412480261,2.0900759591459606,71.410431444974307,28.021420028087782,null,6818.9347790110596,9548.9337356341675,9402.0702451641664,10375.130637450553,12425.723965122026,7934.5115416271465,null,1696.7414414444731,null,39.273455234755374]
[35,60,"SPP","Southwest Power Pool",74092.200000000012,1981160356.1308832,969455643.18138027,222181961.16369998,106061490.59528339,173192.79979690717,82491.367417594753,254322.20072576118,177282926.65652871,5031475.1150514791,4935959.0475221118,178100621.66437227,"N/A",1.5590176528264741,1.5555385268413939,2.2893145725577675,1595.8354650214794,22.645740854471853,22.21584066352434,1603.1960536449731,-0.17511322609729765,0.1748397591956109,0.1701807978483468,0.25674065195049733,178.96878070259217,"N/A",1.7860701500966893,1.7820843305268397,2.622726185822029,1828.2500415393195,25.943825391372396,25.451315318006547,"N/A",2.1486999999999998,21.807600000000001,1.03,1.7923,2.1202999999999999,21.7134,1.0863,1.7444999999999999,3.8773,0.65880000000000005,5.8900000000000001E-2,2.6202000000000001,2216.9653032028673,1561.7649624471421,1096.9254000000001,1852.1407999999999,"N/A","N/A",0.20019999999999999,2.0577999999999999,0.11119999999999999,0.1749,0.19719999999999999,2.0247999999999999,0.1154,0.17019999999999999,0.36120000000000002,6.2199999999999998E-2,6.4000000000000003E-3,0.25569999999999998,206.54772430616381,147.37139999999999,118.45399999999999,180.74440000000001,"N/A","N/A",1.8751,2.2774999999999999,2.0739000000000001,1709.2275,27.26,19.484000000000002,null,"N/A",123015047.90300001,1234928.5119999999,66984115.736700013,8284924,3126876,2348955.6869999995,16715288,117586,0,324736.77500000002,29502.55,199873255.47670001,22308705.686999999,19181829.686999999,193937287.16369998,28244674,55.366802623712807,0.55581853069076348,30.148314195204723,3.7288913810135131,1.4073491761539405,1.0572216010233737,7.5232426217016117,5.2923288364245098E-2,0,0.146158028896297,1.3278553238740659E-2,89.959263312756846,10.040736687243172,8.6333875110892304,87.287593532766692,12.712406467233311,null,8916.8371084419286,10215.469057575354,9456.6000385074167,10733.428851129243,10597.476596185843,9260.349165076741,null,1846.3888255300228,null,18.138783990703359]
[36,61,"TRE","Texas Regional Entity",115787.5999999999,2523758252.6122041,1265106191.9410806,360221517.29580003,174463757.72958341,109604.19227257083,52291.099984574037,346399.69942373456,205873315.51288,6015952.8009627005,4443234.9563777614,206625056.64048168,"N/A",0.60853773031314007,0.59944942909718324,1.9232593434405223,1143.03730137156,16.700703628491553,12.334729445740322,1147.2110727400504,-8.6571730178994499E-2,8.6857916885759986E-2,8.2666736306685265E-2,0.2745109988765328,163.14820589475383,"N/A",0.75221440133976991,0.74098033857288337,2.3773437596100901,1412.9101229562141,20.643764808788941,15.246977571860908,"N/A",1.3090999999999999,2.6528999999999998,0.39050000000000001,0.754,1.2599,2.7768999999999999,0.39019999999999999,0.72260000000000002,4.9743000000000004,89.738600000000005,8.8000000000000005E-3,2.3855,2252.0234,3061.8507,881.99504994877407,1418.1325999999999,"N/A","N/A",0.1249,0.189,5.2299999999999999E-2,8.7099999999999997E-2,0.11890000000000001,0.19789999999999999,5.1400000000000001E-2,8.2799999999999999E-2,0.47460000000000002,6.3935000000000004,1.1999999999999999E-3,0.27550000000000002,214.86689999999999,218.14449999999999,118.03734881056778,163.78819999999999,"N/A","N/A",0.72489999999999999,0.85229999999999995,2.0299,1280.5898999999999,21.530899999999999,10.707000000000001,null,"N/A",109893817.39680001,3404969.3039999995,176680238.29700002,38441017,392973.42000000004,712025.00300000003,29851836,118265,0,433813.20500000002,292562.67,329146417.87279999,31075099.423,30682126.002999999,291417425.87580001,68804091.420000002,30.507288465658046,0.94524317413386783,49.047663677435736,10.671493832067149,0.10909215611273589,0.19766309584868927,8.2870774139477135,3.283118701176458E-2,0,0.12042956463474372,8.1217433149546922E-2,91.373336147079087,8.6266638529209043,8.5175716968081669,80.899505410860627,19.100494589139362,null,7006.1285387896214,8660.2859970625468,7818.5724002095385,10481.015921949822,14035.883095837851,7472.1692653758573,null,1418.4526549440798,null,5.5425319878656865]
[37,62,"WECC","Western Electricity Coordinating Council",257842.1999999999,3969162668.6090117,1762237356.8645198,735740092.78276694,330513273.89308316,316886.98406876373,136813.22531223623,220081.60140262329,323450379.2947346,14748680.97313131,8633312.1233722698,324943105.4264701,"N/A",0.86141012886823098,0.82788339300704494,0.59825909600825333,879.25174247704319,20.046047670649337,11.73418739587612,883.3094964213459,-0.29091523229412541,0.15967447571495799,0.15527218825466585,0.11089573281699268,162.98166958628954,"N/A",1.4754952986103327,1.418067901969519,1.0247482052141921,1506.0559062897571,34.336546672167351,20.099297367649484,"N/A",2.8285999999999998,1.1742999999999999,0.31019999999999998,1.4805999999999999,2.8435000000000001,1.3241000000000001,0.35339999999999999,1.4441999999999999,1.9371,14.778600000000001,1.54E-2,0.96809999999999996,2254.2432780904028,1602.9698000000001,906.95908307864977,1536.6641,"N/A","N/A",0.26050000000000001,0.1227,4.0399999999999998E-2,0.1615,0.2606,0.13880000000000001,4.4900000000000002E-2,0.15690000000000001,0.1784,1.5438000000000001,2E-3,0.1056,207.58279999999999,167.4503,118.37953850204144,167.65090000000001,"N/A","N/A",1.0338000000000001,1.1242000000000001,0.71319999999999995,1278.28,31.0931,12.688000000000001,null,"N/A",192722716.10499996,2812033.5226666657,222661852.98010004,59775033,189773312.72999999,9697664.4847939983,38228372.890000001,3146691.96,15283651,571475.32720599999,1067288.7830000001,479610399.71797299,256129693.06479406,66356380.334794015,429533031.2027666,306207061.57999998,26.194401799699513,0.38220474189884074,30.263656305303819,8.1244767800969964,25.793526082318863,1.3180829181287135,5.1959072592347129,0.42769070095097911,2.0773165890950867,7.767353346812006E-2,0.14506328980431485,65.18747645027166,34.812523549728368,9.0189974674094948,58.381082588303308,41.618917411696643,null,5394.789148429536,9240.6459579945968,7624.653371977126,10859.489698040508,9572.8093649279817,7661.4514176620942,null,1549.2026114391563,null,43.146705149399168]
[38,2,"AK",2,2762,55212470.126647122,21979611.396476645,6928294.4960000003,2577024.1403333335,11728.385487278967,4818.8578878452345,2384.2516613235985,3766232.7197810858,170189.68990352438,46156.740539509839,3775174.0063086967,"N/A",3.3856486597243416,3.7398624346777933,0.68826510267429564,1087.2034154886148,24.564442230592558,6.6620638839988819,1089.784508579497,"N/A",0.42484552712009571,0.43848435724552459,8.6366418885247098E-2,136.42688730071484,"N/A",4.3976101139736556,4.8576974519701857,0.89398572646401941,1412.1656487205353,31.906689221016446,8.6533372067606873,"N/A",6.2821999999999996,10.129300000000001,2.3917999999999999,4.3975999999999997,6.024,10.2376,2.6417000000000002,4.7388000000000003,3.5739999999999998,2.0779000000000001,3.8399999999999997E-2,0.89400000000000002,2165.0120000000002,1397.8608999999999,1271.2256190732621,1412.1656,"N/A","N/A",0.61680000000000001,1.1718,0.22,0.42480000000000001,0.60770000000000002,1.133,0.22800000000000001,0.4385,0.35089999999999999,0.2404,3.5000000000000001E-3,8.6400000000000005E-2,212.5771,161.70419999999999,116.92400000000001,136.42689999999999,"N/A","N/A",8.4473000000000003,7.0044000000000004,0.59370000000000001,1387.6247000000001,38.613999999999997,6.0785999999999998,null,"N/A",684959.15500000003,1037761.5910000001,3608695.378,0,1575045,2565.3719999999998,19268,0,0,0,0,5331416.1239999998,1596878.372,21833.371999999999,5333981.4960000003,1594313,9.8864035787661173,14.978601033762986,52.086345060583866,0,22.733516898124648,3.7027467603767399E-2,0.2781059611586118,0,0,0,0,76.951349673112972,23.048650326887024,0.31513342876237915,76.988377140716736,23.011622859283261,null,7969.1286446503736,10351.08017679691,10171.195709936972,10184.596553438729,8644.5553053043768,10872.238540190741,null,1412.1657801718543,null,1.3145131902092544E-4]
[39,3,"AL",1,36284.100000000006,940198951.46463358,457545013.67539287,153105216.95300001,69693465.611249983,49346.433436426567,24871.133388028065,137191.45905764689,76372600.886547849,2944703.0711579216,2041775.6460289368,76719995.49392952,"N/A",0.64460812529431777,0.71372927633586769,1.7921199785081354,997.64857666466833,19.233198775074282,13.335767955286057,1002.1865619050839,"N/A",0.10497019457329777,0.10871556959277887,0.29183495438690132,162.46051065591018,"N/A",0.94146726723489071,1.0424205419853536,2.6174387701873081,1457.0922119612057,28.0905970316261,19.477242871565249,"N/A",1.6161000000000001,23.658200000000001,8.5900000000000004E-2,0.91210000000000002,1.696,23.645399999999999,9.06E-2,0.96230000000000004,4.7515000000000001,1.5179,4.4999999999999997E-3,2.5640999999999998,2055.1831999999999,1582.1776,872.01350000000002,1510.0912000000001,"N/A","N/A",0.15540000000000001,2.4380000000000002,1.17E-2,0.10150000000000001,0.16159999999999999,2.4380000000000002,1.2200000000000001E-2,0.10580000000000001,0.45689999999999997,0.15640000000000001,5.9999999999999995E-4,0.28520000000000001,197.6146,163.04490000000001,118.8566,167.97219999999999,"N/A","N/A",1.4089,1.9529000000000001,4.8074000000000003,1585.7968000000001,26.470600000000001,22.061499999999999,null,"N/A",45606920.015999988,109583.16099999998,55705000.407999992,40841212,7435223,3229612.1080000005,0,0,0,177666.26,0,142440381.84499997,10664835.107999999,3229612.1080000005,104828781.95299999,48276435,29.787959498467202,7.1573760307357542E-2,36.383476354760809,26.675258239265204,4.8562832462348116,2.1094069635729147,0,0,0,0.11604193739168255,0,93.034309790192239,6.9656902098077254,2.1094069635729147,68.468458514499972,31.531541485500014,null,6140.8681570481976,8968.9008490642591,9440.8288990678229,10399.956278534077,9703.9379949940176,7336.6855521695888,null,1506.5260071991916,null,49.433795237985805]
[40,4,"AR",5,18689.199999999997,461695316.62623501,221026926.19895065,65005677.873000011,29402200.395500001,37359.334733115786,17430.687254032149,82001.393545885832,40020363.659988955,1562067.4978207953,1244521.7549769757,40229666.240737505,"N/A",1.1494175879868154,1.185672297961748,2.5228994213733125,1231.2882495641611,24.029708618262056,19.144816202184174,1237.7277664678218,"N/A",0.16183545029701915,0.15772455920906622,0.35521865001836256,173.36265809422278,"N/A",1.5806227613723922,1.6304784625485869,3.4693676969571809,1693.2072846390167,33.044478167152441,26.327013408994723,"N/A",2.2787000000000002,"N/A",0.30259999999999998,1.5414000000000001,2.3031000000000001,"N/A",0.36049999999999999,1.5104,5.3753000000000002,"N/A",6.1999999999999998E-3,3.3719999999999999,2276.1671999999999,"N/A",889.82370000000003,1758.9102,"N/A","N/A",0.2099,"N/A",4.0399999999999998E-2,0.16059999999999999,0.20930000000000001,"N/A",4.6899999999999997E-2,0.15659999999999999,0.49519999999999997,"N/A",8.0000000000000004E-4,0.3513,209.7099,"N/A",118.8288,183.25479999999999,"N/A","N/A",1.2484,1.4246000000000001,2.4262999999999999,1414.431,34.785800000000002,19.0305,null,"N/A",28430929.82,32559.603999999999,17117412.936999999,15493131,2240882,1660370.0640000002,0,0,0,30392.448,0,61104425.808999993,3901252.0639999998,1660370.0640000002,47271664.872999996,17734013,43.73607160215267,5.008732323907289E-2,26.332181275675435,23.8335042521494,3.4472096489447521,2.5541923695401261,0,0,0,4.6753528298523361E-2,0,93.998597981515104,6.0014020184848773,2.5541923695401261,72.719286098905812,27.280713901094153,null,7102.3844644499786,9766.8511965175167,7718.3844570510573,10853.885295830096,"-",7488.2831434803693,null,1789.8223626475781,null,96.615078008561341]
[41,5,"AZ",4,35774.800000000003,670369580.97656345,322632308.5404374,110614113.36099999,52578137.362000011,49017.268182386862,21695.765401788478,21055.102629977428,58602854.82569696,1724213.411950252,1588514.7218428692,58867178.848408073,"N/A",0.88627511793932134,0.8252770634460983,0.38069468696570463,1059.5909155722436,15.587643923186482,14.360868370011664,1064.3701252893341,"N/A",0.14623953584224622,0.13449220569346185,6.2816402257707835E-2,174.83745232093327,"N/A",1.3868700263439875,1.2914184315405099,0.595722524365499,1658.0798120681723,24.392015188979279,22.47231981526102,"N/A",2.2637999999999998,10.5909,0.1946,1.3819999999999999,2.3037999999999998,10.8536,0.1933,1.2466999999999999,1.016,4.8284000000000002,2.9899999999999999E-2,0.5958,2208.6972999999998,5160.1833999999999,929.46169999999995,1663.5338999999999,"N/A","N/A",0.21129999999999999,0.33460000000000001,2.5000000000000001E-2,0.1459,0.2142,0.34079999999999999,2.46E-2,0.1341,9.4799999999999995E-2,0.15260000000000001,3.8E-3,6.2899999999999998E-2,206.1052,163.04490000000001,119.27670000000001,175.65729999999999,"N/A","N/A",0.56769999999999998,0.63339999999999996,0.28760000000000002,1112.6186,18.886299999999999,8.2022999999999993,null,"N/A",40115665.671999998,41911.916000000005,30295010.499000002,31933916,6796379,235028.274,249411,946791,0,0,0,102386504.087,8227609.2740000002,1431230.274,70687616.360999987,39926497,36.266317609108881,3.7890206526554497E-2,27.388015487796995,28.869657794734149,6.1442240899399083,0.2124758467601347,0.22547846058849905,0.85594050454489012,0,0,0,92.561881098166566,7.4381189018334322,1.2938948118935238,63.904699150192549,36.095300849807444,null,6060.4344292734759,9483.5505211125219,6334.0299549179008,10716.358927382715,{"$f":"1000*AY47/BQ47","v":31648.848875371135},7792.4833601197879,null,1665.8548789522185,null,7.7750668840462822]
[42,6,"CA",6,97737.499999999971,1022257541.8385103,460274489.28885847,199189655.76309997,91285385.256583393,18268.770851504276,8645.907620228274,17622.664774126726,57165609.732720844,6596594.7582436958,894245.83554438129,57373339.761379912,"N/A",0.18343091945730025,0.18942588884138475,0.17694357376756248,573.98171118593621,33.117155270799557,4.489419052000998,576.06746235472303,"N/A",3.5742012367349717E-2,3.7568484986367723E-2,3.4477935457306985E-2,111.8418938341303,"N/A",0.28169067561619332,0.29089701324508072,0.27172820693477001,881.4506109093719,50.857259344924657,6.8942983528835002,"N/A",0.88819999999999999,0.92930000000000001,0.2177,0.2326,0.94389999999999996,0.95220000000000005,0.24030000000000001,0.25430000000000003,10.561400000000001,2.6882000000000001,8.8000000000000005E-3,0.14949999999999999,1739.0607,1514.0219,888.8675246039785,911.46429999999998,"N/A","N/A",0.105,9.2799999999999994E-2,2.8799999999999999E-2,3.0599999999999999E-2,0.1066,9.6600000000000005E-2,3.1E-2,3.2599999999999997E-2,1.2483,0.26840000000000003,1.1999999999999999E-3,1.9699999999999999E-2,205.55500000000001,151.1474,118.04837341194113,119.82380000000001,"N/A","N/A",0.26629999999999998,0.33110000000000001,0.26469999999999999,992.88729999999998,40.109099999999998,5.3691000000000004,null,"N/A",1258252.558,1692979.7999999998,119645391.89810002,18507408,27409558,6273299.9705689996,9685429,1360234.96,12518999,180918.51543099998,657184.06099999999,141942134.83253103,57247520.930569008,29837962.930569015,129708026.8031,69481628.960000008,0.63168569330551161,0.84993359394801737,60.066066904797779,9.2913499594633624,13.760532842427674,3.149410518601405,4.8624156525071083,0.682884336934521,6.2849644234985185,9.0827264467071428E-2,0.32992881004905267,71.259792226030811,28.740207773969232,14.97967493154156,65.117852785168836,34.882147214831193,null,5132.081472414915,7881.2203610985653,8286.2277777870495,8460.3181630220624,10016.857054769052,7529.6888801863452,null,944.35777230420229,null,62.907161394830382]
[43,7,"CO",8,16952.100000000002,457759946.88524479,205706407.91943613,52547910.612999991,23245124.402916666,51081.155075839997,23006.632831222967,41588.090642757677,43843974.093950994,1063915.7821250495,1320662.8430291628,44059835.169737086,"N/A",1.9441745439523859,1.9794802929371482,1.5828637202739348,1668.7237830196163,20.246585824515048,25.13254718642305,1676.9395645137977,"N/A",0.22317878802378252,0.22368416291857468,0.18170261913798821,191.55880453185296,"N/A",2.2617358772660525,2.3028084648076281,1.8414085690518398,1941.2930084095531,23.553661729547603,29.237695676776195,"N/A",2.6084999999999998,32.616700000000002,1.0936999999999999,2.2673999999999999,2.5546000000000002,33.212899999999998,1.431,2.2574999999999998,2.3637000000000001,6.3411999999999997,7.1199999999999999E-2,1.8460000000000001,2229.6275999999998,5640.9519,974.23316606645722,1946.7154,"N/A","N/A",0.24360000000000001,0.94269999999999998,0.13300000000000001,0.22339999999999999,0.24,0.94379999999999997,0.16789999999999999,0.22389999999999999,0.22070000000000001,0.18329999999999999,8.6999999999999994E-3,0.18190000000000001,208.17830000000001,163.03210000000001,118.51374957050975,191.82069999999999,"N/A","N/A",2.2006000000000001,2.4967000000000001,1.4730000000000001,1656.1746000000001,22.765699999999999,20.417100000000001,null,"N/A",34521019.928999998,11045.194000000001,10524444.992000001,0,1252741,57989.498,5961967,163335,0,0,55368,45111878.114999995,7436032.4979999997,6183291.4979999997,45169867.612999991,7378043,65.694372100229103,2.1019282919438279E-2,20.028284415548818,0,2.3839977372765047,0.11035547812181479,11.345773657697155,0.31083062693570168,0,0,0.10536670127147232,85.849042499968832,14.150957500031174,11.76695976275467,85.959397978090649,14.040602021909359,null,8711.2873099087246,10134.188366615899,8633.9722459567729,10710.182569460887,34600.252956319644,8220.4231120612476,null,1943.9471064161182,null,2.6540980065651638]
[44,8,"CT",9,10902.7,146138524.07041621,66500837.379889049,35557337.401000001,15682721.955,4385.738869816947,2208.7935753522152,19617.585450784492,9332621.4755883962,2009867.9452782851,264162.70028365689,9394670.3075577877,"N/A",0.24668544893317035,0.2816849755661201,1.1034338836761595,524.93365126523383,56.524703259186118,7.4292036353719695,528.42372316064223,"N/A",6.0021666397885587E-2,6.6429045479063129E-2,0.26847931543816395,127.72294690880432,"N/A",0.48288874658493625,0.55140060093200727,2.159980685249415,1027.5618363221513,110.64756038897283,14.542725755100808,"N/A",2.1404000000000001,3.0680999999999998,0.1678,0.20300000000000001,2.1291000000000002,3.0499000000000001,0.18,0.2218,2.9087999999999998,2.4344000000000001,1.5800000000000002E-2,7.9699999999999993E-2,3146.5745000000002,2230.4521,851.58799999999997,883.07539999999995,"N/A","N/A",0.1426,0.21440000000000001,2.3400000000000001E-2,2.7699999999999999E-2,0.1474,0.21410000000000001,2.4799999999999999E-2,2.9899999999999999E-2,0.19370000000000001,0.1701,2.2000000000000001E-3,1.09E-2,209.56909999999999,155.8621,118.995,120.5718,"N/A","N/A",0.5111,0.90669999999999995,0.41589999999999999,1063.1012000000001,95.917699999999996,13.348800000000001,null,"N/A",95875.426000000007,107534.765,16538171.221000001,17077887,314857,687881.40682699997,0,0,0,735130.58217299997,0,34554598.994172998,1002738.406827,687881.40682699997,18164593.401000001,17392744,0.26963612297163636,0.30242637064544586,46.511275674243507,48.029150235303355,0.88549093665023715,1.934569506904795,0,0,0,2.0674511532810258,0,97.179939556444964,2.820060443555032,1.934569506904795,51.085358828046409,48.914641171953591,null,4109.9400222893591,8045.2405866883309,8817.1628855171766,15014.496411923323,14310.419916066832,7156.5023740493298,null,970.02913897006806,null,-57.532697352083233]
[45,9,"DC",11,860.8,692775.978,372786.32162089698,71786.78,36239.453000000001,45.355953979999995,26.970829786561261,23.104651869188409,44221.212397956318,2367.2531777240001,350.38086609800001,44300.377590567601,"N/A",1.2636297095370483,1.4884788568172518,0.64370213761331563,1232.0154880315379,32.976171625527712,4.8808550278756071,1234.2210526943152,"N/A",0.13093974219758525,0.14469860197278964,6.6701654222740409E-2,127.66381572761843,"N/A",1.2636297095370483,1.4884788568172516,0.64370213761331574,1232.0154880315376,32.976171625527712,4.8808550278756071,"N/A","N/A",4.4604999999999997,0.78200000000000003,1.2636000000000001,"N/A",4.9743000000000004,0.78200000000000003,1.4884999999999999,"N/A",4.7228000000000003,2.92E-2,0.64370000000000005,"N/A",2814.8982000000001,993.5471,1232.0155,"N/A","N/A","N/A",0.25800000000000001,9.1999999999999998E-2,0.13089999999999999,"N/A",0.26040000000000002,9.1999999999999998E-2,0.1447,"N/A",0.2732,3.3999999999999998E-3,6.6699999999999995E-2,"N/A",162.8339,116.8879,127.66379999999999,"N/A","N/A",2.2216999999999998,4.8548999999999998,1.8662000000000001,1706.3915,59.244700000000002,10.650399999999999,null,"N/A",0,9399,62387.78,0,0,0,0,0,0,0,0,71786.78,0,0,71786.78,0,0,13.092939953568052,86.907060046431951,0,0,0,0,0,0,0,0,100,0,0,100,0,null,9650.4673701759566,9650.4673701759566,13366.290992434817,"-",17286.929810070262,8499.9995722397271,null,1232.0153362526694,null,-1.5177886825767928E-4]
[46,10,"DE",10,3999.4,80579254.71832414,40475020.941439956,8633823.2577999998,4306143.0162000004,2412.3296473959522,1264.4168989872351,3279.2968696553075,5424329.7434819816,184373.76857130235,78240.418611435583,5438386.8714677589,"N/A",0.55880913365155971,0.58726191593284915,0.75963956447515024,1256.5301793921976,21.354823125981266,9.0620824952319161,1259.7864721297351,"N/A",5.9874707350634652E-2,6.247887559176895E-2,8.1393080169791604E-2,134.63340564375957,"N/A",0.56050984909108104,0.5890492263888244,0.76195150008603052,1260.354383664509,21.419815759801114,9.0896626163962697,"N/A",1.2031000000000001,20.819199999999999,0.43099999999999999,0.5645,1.1096999999999999,13.9596,0.46289999999999998,0.59230000000000005,4.3407999999999998,28.488800000000001,2.18E-2,0.76739999999999997,2130.9110000000001,11943.5844,1089.5800247484042,1265.9492,"N/A","N/A",0.11509999999999999,0.28310000000000002,4.7300000000000002E-2,6.0400000000000002E-2,0.1081,0.21729999999999999,5.0299999999999997E-2,6.2899999999999998E-2,0.41520000000000001,0.38740000000000002,2.3999999999999998E-3,8.2100000000000006E-2,203.82419999999999,162.4111,119.53075432855032,135.4288,"N/A","N/A",0.65880000000000005,0.85050000000000003,1.1802999999999999,1315.0641000000001,21.552099999999999,10.2316,null,"N/A",1422702.5,265342.92179999995,6814727.2180000003,0,0,104853.618,3638,22559,0,0,0,8502772.6398000009,131050.618,131050.618,8607626.2577999998,26197,16.478244429137426,3.0732957332695325,78.930585147702843,0,0,1.2144517540971524,4.2136604970611891E-2,0.26128633082243913,0,0,0,98.482125310109822,1.5178746898902034,1.5178746898902034,99.696577064206949,0.30342293579305102,null,9332.9747798030203,9361.3793518631664,9710.3725352362289,{"$f":"1000*AX52/BP52","v":10454.651606629635},73539.212529192897,9115.4785299313935,null,1267.8003719676062,null,7.4459883030972378]
[47,11,"FL",12,83533.400000000009,1728428769.8462782,826093021.87033403,221099929.55259997,103843645.72811662,72573.656385479058,35418.092162917528,142273.76283586182,125651562.04957716,8748624.0136520825,2690783.8127414733,126160137.92193209,"N/A",0.65647833115400156,0.68214269471334155,1.2869634388735951,1136.6042703300318,39.568642248575543,12.169989462169106,1141.2046867425022,"N/A",8.397645034794643E-2,8.574843564887745E-2,0.16462785776068198,145.39397196073321,"N/A",0.71541361905158907,0.74338199872737776,1.4025004751842298,1238.6428247173112,43.120913834656868,13.262549259843965,"N/A",1.5649,15.084899999999999,0.35799999999999998,0.6361,1.607,20.3413,0.37959999999999999,0.66810000000000003,3.0785,0.8357,0.19439999999999999,0.85670000000000002,2194.4508608768824,3655.6637000000001,905.55072363157058,1229.1601000000001,"N/A","N/A",0.14649999999999999,0.66979999999999995,4.6100000000000002E-2,7.5399999999999995E-2,0.15160000000000001,0.65969999999999995,4.8099999999999997E-2,7.8399999999999997E-2,0.28820000000000001,3.7100000000000001E-2,2.5000000000000001E-2,0.10150000000000001,205.41103391404386,162.32740000000001,122.51025029376638,145.6275,"N/A","N/A",0.96489999999999998,1.2301,1.6527000000000001,1368.8576,38.2194,14.7201,null,"N/A",44286391.391000003,1375873.0406000004,149699641.33300003,17869935,150511,4379283.551372,0,193615.98499999999,0,1387796.741628,1756881.51,216376519.01622796,4723410.5363719994,4572899.5363719994,202885867.56759995,18214061.984999999,20.030034148185567,0.62228560786252007,67.70677929926083,8.0822888709915759,6.8073743987418694E-2,1.9806806633695297,0,8.7569446716598123E-2,0,0.6276785091864272,0.79460971043956641,97.863676145926448,2.1363238540735461,2.0682501100861277,91.762067938304398,8.2379320616955916,null,7817.4098623359478,8519.2171863344774,9399.7191464524221,10683.218029052767,22520.312036045671,7391.6323039105509,null,1240.6323008029242,null,1.9894760856129778]
[48,12,"GA",13,48472.3,788221699.47848523,405866328.73803329,122014744.25300002,58696076.052683331,38558.185021137127,16537.195967817654,115772.35086164155,65893467.830973007,2403508.2252847929,1804357.6506083021,66198380.103182793,"N/A",0.6320250107017551,0.56348557109591124,1.8976780481805586,1080.0902503117422,19.698506438706051,14.788029607855671,1085.0882081253906,"N/A",9.7835888168642304E-2,8.1490849557473877E-2,0.29375580737815399,167.19526466873575,"N/A",0.88973773869282247,0.79325085134881268,2.6714698734476685,1520.5047911466543,27.730713623089304,20.817954669874386,"N/A",1.6189,3.9903,0.10639999999999999,0.88029999999999997,1.3063,3.9169,0.1229,0.73919999999999997,4.9561999999999999,29.424399999999999,2.6200000000000001E-2,2.65,2298.1341000000002,1114.7581,884.05269999999996,1587.0607,"N/A","N/A",0.1462,0.70379999999999998,1.43E-2,9.5399999999999999E-2,0.1195,0.69789999999999996,1.5800000000000002E-2,7.8899999999999998E-2,0.44750000000000001,5.1897000000000002,3.5000000000000001E-3,0.2873,207.48349999999999,196.6147,119.10299999999999,172.04300000000001,"N/A","N/A",1.1301000000000001,1.2097,3.3858999999999999,1697.54,27.2349,24.4361,null,"N/A",40715049.07,380431.97100000002,42278366.133000001,33941634,1398416,3247636.5889999997,0,1547,0,51663.490000000005,0,117367144.664,4647599.5889999997,3249183.5889999997,86673147.253000021,35341597,33.368958251124575,0.3117918029735543,34.650210834630741,27.817649586365842,1.1461041110739505,2.6616755285459273,0,1.2678795578936464E-3,0,4.2342005727500215E-2,0,96.190952480822205,3.8090475191777715,2.6629434081038208,71.034978423002329,28.965021576997685,null,6460.052875610605,9094.1857364156403,9866.9518666844906,11076.225820366441,5669.7596873478942,7422.5896912756189,null,1564.5909966501561,null,44.086205503501787]
[49,13,"HI",15,3081.5999999999995,91564337.920004472,38027952.138682306,10469268.697999999,4408851.5195000004,15333.415252486795,6256.6048432094831,25283.444513553561,7699913.5485563921,880985.66052068339,199607.33769100119,7740103.0353339668,"N/A",2.9292237490123871,2.8382016566160218,4.83003068177696,1470.9553781970174,84.149684752000198,19.066024900968802,1478.6329892961103,"N/A",0.33492111887234727,0.32905294612723673,0.5522552794657356,168.18586195170113,"N/A",3.1579969432836066,3.0598660000069398,5.2072574292627625,1585.8374047455254,90.721798672666679,20.555086779604686,"N/A",0.9758,3.6080999999999999,"N/A",3.1581999999999999,0.94989999999999997,3.5396999999999998,"N/A",3.0832000000000002,10.5067,4.4450000000000003,"N/A",5.3254000000000001,2046.3703,1515.2048,"N/A",1599.4947,"N/A","N/A",9.8000000000000004E-2,0.39290000000000003,"N/A",0.3397,9.7299999999999998E-2,0.38840000000000002,"N/A",0.3347,1.0550999999999999,0.48399999999999999,"N/A",0.57269999999999999,205.5078,164.97800000000001,"N/A",172.0179,"N/A","N/A",2.5678999999999998,2.5621999999999998,3.9984000000000002,1385.5681,113.0098,18.891200000000001,null,"N/A",1537340.3189999999,7529796.6629999997,0,0,114581,286075.30824000004,378234,4608,260997,357636.40775999997,0,9424773.3897599988,1044495.30824,929914.30824000004,9710848.6979999989,758420,14.684314285425554,71.922852304272766,0,0,1.0944508475734225,2.7325242716776441,3.612802488031051,4.4014535617758012E-2,2.4929821511779489,3.41605911622386,0,90.023225705922172,9.9767742940778241,8.882323446504401,92.75574997759982,7.2442500224001805,null,8746.0108782475418,9429.0767746039164,8054.7902282262476,9957.6283722564294,9184.2839651347458,"-",null,1621.9699857061391,null,36.132580960613723]
[50,14,"IA",19,18509.800000000007,390008956.98752928,177441191.27188346,56602145.651000008,24327275.941333339,36946.082347645322,16579.865988537127,96060.260948679133,39703157.877685204,914611.33119775576,1301654.1995223812,39914140.762436315,"N/A",1.3054657883624798,1.3630680252503775,3.394226838712854,1402.8852588906673,16.158598241789392,22.996552242880998,1410.3402018906024,"N/A",0.18946273764080088,0.18687730700739832,0.49260540932525665,203.60126179848086,"N/A",1.9688969070715268,2.055772309751549,5.1191557712313731,2115.8244603795997,24.37031623844959,34.68328391900009,"N/A",2.0089999999999999,15.101699999999999,0.93679999999999997,1.9744999999999999,2.0013999999999998,14.506500000000001,0.91149999999999998,1.9318,5.3792,1.1923999999999999,9.2499999999999999E-2,5.1337000000000002,2168.3682411470072,2659.1084999999998,1135.3811000000001,2133.4063999999998,"N/A","N/A",0.19270000000000001,0.9234,9.8000000000000004E-2,0.19,0.193,0.90110000000000001,9.6100000000000005E-2,0.18740000000000001,0.51590000000000003,7.2900000000000006E-2,9.7000000000000003E-3,0.49390000000000001,207.94986410647201,162.5985,118.76649999999999,205.24760000000001,"N/A","N/A",2.1997,2.2107000000000001,6.1135000000000002,2004.2219,23.9068,31.616399999999999,null,"N/A",35331351.470999993,106557.05899999999,1940885.6140000003,4346995,766191,138152.05369999999,13959232,0,0,12781.453299999999,0,41738570.5973,14863575.0537,14097384.0537,37529727.650999993,19072418,62.42051615648564,0.18825621851336549,3.4289965365751289,7.6799120422093052,1.3536430309978249,0.24407564785940092,24.662019150423102,0,0,2.25812169362067E-2,0,73.74026217071966,26.259737829280329,24.906094798282503,66.30442577636974,33.695574223630231,null,6890.3564079048092,10392.000725780308,9764.8981035588222,10427.360702850881,16353.831677413998,{"$f":"1000*AZ56/BR56","v":9559.7756943245786},null,2132.9332081646662,null,17.108747785066498]
[51,15,"ID",16,5388.699999999998,18695338.474065907,8572418.4147828892,15499089.316,7419313.7310000006,649.87489322228339,229.16153477867167,776.63222944947165,885058.93601164676,143366.66139073431,26625.332105062924,890691.2124325342,"N/A",8.3859752011546301E-2,6.1774321207410242E-2,0.10021649835229218,114.20786318044944,9.2500054982413857,1.7178642926831253,114.93465122664426,"N/A",6.9522666746449871E-2,5.3464850568537156E-2,8.3082981410238982E-2,94.682312089657714,"N/A",0.50116640149252345,0.36917846191458353,0.5989183207038864,682.53414110282085,55.280296663665411,10.266377435721038,"N/A",6.0595999999999997,32.335599999999999,0.28399999999999997,0.40749999999999997,6.0598000000000001,33.270699999999998,0.23830000000000001,0.28699999999999998,4.6052999999999997,2.2412000000000001,0.13070000000000001,0.22620000000000001,1138.5075999999999,2162.4897999999998,892.82960000000003,898.08370000000002,"N/A","N/A",1.0945,2.4380000000000002,3.8300000000000001E-2,5.5199999999999999E-2,1.0945,2.4380000000000002,3.0599999999999999E-2,3.6999999999999998E-2,0.83179999999999998,0.16900000000000001,1.7600000000000001E-2,3.0599999999999999E-2,205.64510000000001,163.04490000000001,120.3069,121.6733,"N/A","N/A",0.39300000000000002,0.34989999999999999,0.54410000000000003,750.36890000000005,45.668700000000001,8.7843999999999998,null,"N/A",76737.150999999998,19,1898167.2850000001,0,10940404.73,549267.16,1890559.02,0,74676,0,69258.97,2044182.406,13454906.91,2514502.1800000002,2593449.5660000001,12905639.75,0.49510748299761587,1.2258784766396529E-4,12.246960103910663,0,70.587403601229752,3.5438673124683606,12.197871639131343,0,0.48180895327127748,0,0.4468583191433233,13.189048493899266,86.810951506100736,16.223547904870983,16.732915806367629,83.267084193632371,null,1206.2217394131899,7208.676320203368,6167.079383891125,5536.2739010071227,13263.155118620696,7421.2667768847841,null,877.1034365110005,null,194.56929540817964]
[52,16,"IL",17,59211.599999999984,989140070.94006395,451375789.81561321,197522000.958,84866180.995000049,58676.987060717009,23716.724263978507,167044.46545807883,98493065.981526941,2284822.9610038539,3096563.1276503797,98997023.907403305,"N/A",0.59413115274377726,0.55892050251149616,1.6914011061846042,997.28704148222937,11.567435272639255,15.677054265508456,1002.3898444452625,"N/A",0.1186424224123309,0.10508638167619393,0.33775694740447076,199.14887461372504,"N/A",1.2578755285860919,1.1833286628507229,3.5809804799287952,2111.4243187943284,24.490205051125226,33.190959319050521,"N/A",1.2915000000000001,26.401299999999999,0.4551,1.2661,1.1698999999999999,29.4193,0.47220000000000001,1.1313,4.1208999999999998,2.7330999999999999,2.2700000000000001E-2,3.6046999999999998,2283.6972000000001,2179.7860999999998,1028.4466,2125.4342999999999,"N/A","N/A",0.11890000000000001,1.9565999999999999,5.2600000000000001E-2,0.1196,0.10639999999999999,1.8053999999999999,5.1900000000000002E-2,0.10589999999999999,0.37930000000000003,0.2026,2.5999999999999999E-3,0.34050000000000002,210.18,161.54400000000001,118.9221,200.74359999999999,"N/A","N/A",1.1435,1.0297000000000001,3.4931999999999999,2017.7816,24.286000000000001,30.338699999999999,null,"N/A",80826777.633000016,200451.71400000001,11188974.940000001,96401309,111208,615193.21200000006,7683448,30657,0,204498.459,259483,189081494.74599996,8440506.2120000012,8329298.2120000003,93295378.958000004,104226622,40.920392280851068,0.1014832337804349,5.6646727380911681,48.805352584747382,5.6301576260179065E-2,0.31145553863177566,3.8899200912984706,1.5520802670745897E-2,0,0.1035319903647004,0.13136916330407925,95.7268019911388,4.2731980088611721,4.2168964326009926,47.232904945023229,52.767095054976778,null,5007.7463074626776,10602.240775348131,10051.536387710494,10865.43534113617,13493.451319764272,8648.0696186831537,null,2128.3319813101748,null,16.907662515846368]
[53,17,"IN",18,37915.200000000019,1114010384.566596,497073588.22168356,114878967.34740001,50031384.445466667,106788.30170961235,45383.552128745709,280009.33031461568,109335741.56087841,2645075.2448243224,3476021.935216886,109902298.25090769,"N/A",1.8591445270687181,1.8142033298404117,4.87485806636567,1903.4945053125593,23.024887025885917,30.258123096678034,1913.3580461000729,"N/A",0.19171868267845307,0.18260295137027346,0.50270506306555274,196.2921406758974,"N/A",1.934500374966122,1.8877375969121428,5.0724484406598496,1980.6479704291394,23.958144155342769,31.484561648676586,"N/A",2.2385000000000002,0.38990000000000002,0.15529999999999999,1.9231,2.1589999999999998,0.4113,0.1885,1.8528,5.9718,0.50800000000000001,2.2800000000000001E-2,5.0410000000000004,2170.6078000000002,1471.9674,915.98450000000003,1975.3444,"N/A","N/A",0.21279999999999999,5.8299999999999998E-2,2.0199999999999999E-2,0.1918,0.20280000000000001,6.1199999999999997E-2,2.3800000000000002E-2,0.18260000000000001,0.56769999999999998,7.5999999999999998E-2,3.0000000000000001E-3,0.50270000000000004,206.36259999999999,220.13310000000001,118.8625,196.96600000000001,"N/A","N/A",1.9316,1.9734,6.1896000000000004,1988.8668,23.996400000000001,31.131399999999999,null,"N/A",92644360.389600009,1279938.4458000001,14470905.097000001,0,433505,336797.73723999999,3210104,2,0,2177124.8797599999,326229.8,110898558.61216003,3980408.7372400002,3546903.7372400002,110404012.4174,3643611,80.645189044430225,1.1141625620026678,12.596653183031517,0,0.37735802297826909,0.29317615314342615,2.7943357031513676,1.7409627246664703E-6,0,1.8951466313030654,0.28397696073769885,96.535128381505203,3.4648716202357877,3.0875135972575185,96.10463513615376,3.1716954670923614,null,9697.2527721090173,10090.307047491189,10097.513276403033,10518.416612312505,6686.7154462459293,7706.253023451467,null,1987.4474179161496,null,6.799447487010184]
[54,18,"KS",20,15927.400000000005,352888848.56310588,173624869.47374716,44286624.611999996,21341707.313833334,34307.955908890915,16700.911165105084,32927.806429239681,35312851.849344894,820114.16273378453,1113954.1020228676,35494125.933867142,"N/A",1.5493597089173856,1.5650960740408839,1.4870316587784158,1594.7411733779527,18.518326242266038,25.153285258977,1602.927576659323,"N/A",0.19444057837807105,0.19237925091866329,0.1866185716171834,200.13583309946966,"N/A",2.2181345818217491,2.2406634855177123,2.1289028800838921,2283.104772484598,26.5116871175961,36.010599448432608,"N/A",2.1833,36.818899999999999,2.5394000000000001,2.2223000000000002,2.1617999999999999,32.576599999999999,2.4584999999999999,2.2065999999999999,2.2808000000000002,1.8545,0.68240000000000001,2.1328999999999998,2363.0826000000002,2635.7316999999998,1544.0041000000001,2287.3452000000002,"N/A","N/A",0.19359999999999999,2.0421,0.2006,0.1948,0.1915,1.863,0.19689999999999999,0.19270000000000001,0.20219999999999999,0.10290000000000001,5.3900000000000003E-2,0.187,209.50620000000001,146.18870000000001,121.95180000000001,200.49850000000001,"N/A","N/A",2.1074999999999999,2.5185,1.6309,2216.0448000000001,27.282399999999999,32.369700000000002,null,"N/A",27982531.291000001,34371.412999999993,2859811.9080000008,8284924,10399,57347,5057240,0,0,0,0,39161638.612000003,5124986,5114587,30934061.612,13352563,63.185062163030132,7.7611272706221646E-2,6.4575070533262089,18.707508356270395,2.3481130230869448E-2,0.12949056403016349,11.41933946040602,0,0,0,0,88.427688845332966,11.572311154667053,11.548830024436183,69.84967105309272,30.150328946907283,null,7968.2940764802925,11407.776094498129,11052.675207046437,11279.296746349273,18029.654138794584,12660.773354718831,null,2287.2419952827336,null,4.1372227981355536]
[55,19,"KY",21,28259.8,923144671.76610672,415170545.55086708,89957452.209999993,39692080.096666664,80461.033762446707,36021.188085848727,186531.71624851288,93278019.359738111,2171107.3714550817,3115383.1483058059,93783700.375125781,"N/A",1.7888686659247641,1.8150315124892527,4.1471098094923002,2073.8252822453546,24.13482505470218,34.631740581460008,2085.0679531517558,"N/A",0.17431944574519037,0.17352477660983481,0.40412239154595619,202.08754318276902,"N/A",1.837100705310003,1.8639689627690783,4.2589254880138645,2129.7404115092759,24.785555795738706,35.565492459125579,"N/A",1.867,31.567399999999999,0.50029999999999997,1.8421000000000001,1.8812,31.572299999999998,0.53290000000000004,1.8492,4.3495999999999997,2.3965000000000001,9.7999999999999997E-3,4.2686999999999999,2154.1659,2111.1185999999998,1285.5081,2137.9760999999999,"N/A","N/A",0.17710000000000001,2.4380000000000002,4.6199999999999998E-2,0.17460000000000001,0.17699999999999999,2.4380000000000002,4.8599999999999997E-2,0.17380000000000001,0.41249999999999998,0.18509999999999999,8.9999999999999998E-4,0.40460000000000002,204.2859,163.04490000000001,118.6913,202.6474,"N/A","N/A",1.8275999999999999,1.9762999999999999,4.3555999999999999,1962.2655999999999,23.66,31.9162,null,"N/A",82760807.668864697,1536523.631109461,2957384.1870258576,0,2361782,332879.45299999998,0,0,0,8075.27,0,87262790.756999999,2694661.4529999997,332879.45299999998,87595670.209999993,2361782,91.999946236432777,1.7080559679731073,3.2875366235606927,0,2.6254434090536147,0.37004099696255727,0,0,0,8.9767660172820271E-3,0,97.004515593983839,2.9954844060161712,0.37004099696255727,97.374556590946398,2.6254434090536147,null,10262.014420006957,10538.702079143632,9683.152115447816,10544.858455723082,12948.081172732171,10830.685147100083,null,2135.640575713051,null,5.9001642037751481]
[56,20,"LA",22,30604.9,816050783.83078384,390180135.07103425,103347602.39899999,49384922.233666658,57596.353633797262,27903.33959228839,94601.577705206044,59664031.270558529,2404235.2923376225,1163119.5802095919,59869559.276060551,"N/A",1.1146142202976654,1.1300347689224928,1.8307454746743388,1154.628262012508,23.263580736546299,11.254441837161057,1158.6056741774953,"N/A",0.14115874838921896,0.14302798673852754,0.23185218268186264,146.22627035655285,"N/A",1.4252580116889721,1.4449762783968065,2.3409755659192144,1476.4239958434766,29.747157555984842,14.391062937648172,"N/A",1.8487,1.6140000000000001,1.1065,1.3348,1.8911,0.76500000000000001,1.1328,1.3301000000000001,6.4123999999999999,8.1297999999999995,3.2599999999999997E-2,2.0754000000000001,2239.2809000000002,2274.2375000000002,1030.7587000000001,1411.4994999999999,"N/A","N/A",0.16769999999999999,0.1598,0.1258,0.1409,0.17100000000000001,0.15809999999999999,0.12820000000000001,0.1429,0.58169999999999999,0.80479999999999996,3.7000000000000002E-3,0.219,203.13579999999999,225.1251,117.2051,148.9614,"N/A","N/A",1.4355,1.7101,1.3298000000000001,1398.6977999999999,29.359400000000001,10.379799999999999,null,"N/A",21421868.864,3029847.5840000007,58518650.148000009,15659132,679944,2430042.2259999998,0,0,0,1329792.0269999998,278325.55,100237616.17300001,3109986.2259999998,2430042.2259999998,80822353.793393403,16339076,20.727978556575863,2.9317057325650335,56.623132796127884,15.151906417280872,0.65791947197275213,2.351329077396684,0,0,0,1.2867178300527919,0.26931011802814026,96.990751450630583,3.0092485493694361,2.351329077396684,78.204382024614304,15.809825889253624,null,7896.1752850367056,10096.845062405118,9389.6660477143723,11023.566008551918,10102.105451591138,8794.4867586820037,null,1504.0401760789539,null,27.616180235477259]
[57,21,"MA",25,16284.900000000003,248702937.91414362,124835354.97081345,36198121.511000007,17652965.944833323,11083.445178118105,3206.1071012242278,27474.682320970118,16287831.549741441,2872403.5878673797,450408.26323385705,16387805.068215294,"N/A",0.61237681489908424,0.36323721591527713,1.5180170226579861,899.92689508994772,79.352283156309753,12.442862900965331,905.4505805355293,"N/A",8.9129989947640209E-2,5.1365370042386095E-2,0.22094376971497484,130.98222068743129,"N/A",0.74851837802068266,0.44399089756273247,1.8554974844940704,1099.9956292612476,96.993617059436019,15.209118519777947,"N/A",1.3682000000000001,4.9739000000000004,0.13300000000000001,0.2515,1.2101999999999999,4.5336999999999996,0.1424,0.23019999999999999,9.2152999999999992,4.4827000000000004,1.1900000000000001E-2,0.8337,2079.1412,2311.0915,899.04499999999996,1006.0386,"N/A","N/A",0.13009999999999999,0.3488,1.7600000000000001E-2,3.2099999999999997E-2,0.1149,0.33329999999999999,1.89E-2,2.9600000000000001E-2,0.87629999999999997,0.31440000000000001,1.6000000000000001E-3,0.10639999999999999,197.7003,162.06639999999999,118.9259,128.4212,"N/A","N/A",0.68189999999999995,0.65839999999999999,2.4937999999999998,1189.9840999999999,55.462200000000003,13.282999999999999,null,"N/A",2136922.1090000002,174493.64699999997,24672380.729999997,5859540,604937.05000000005,1754561.5097700001,89673.4,29614.21,0,875998.85522999999,0,33719335.341230005,2478786.16977,1873849.11977,29614356.851,6583764.6600000001,5.9034060879391905,0.48205166377756437,68.159284791898571,16.187414582326831,1.6711835441962637,4.8471065252289902,0.24772942975162329,8.1811455301625896E-2,0,2.4200119195793035,0,93.152169045521489,6.8478309544785025,5.1766474102822393,81.811860988423632,18.188139011576343,null,6870.6034327932439,8398.0529837420927,9266.2589977355747,10516.631487155053,14260.152011768017,7559.7073471800504,null,1078.48804183574,null,-21.507587425507609]
[58,22,"MD",24,14595.8,242687988.84029001,128344753.05217735,37808347.211999997,18175573.035333335,17762.966072494331,8431.7870072219321,33960.21471891235,22269423.215831771,1276615.875225724,719514.87371014431,22394352.487946726,"N/A",0.93963197983203783,0.92781525961580713,1.796440057455551,1178.0162243518371,33.765450472284556,19.030582576796093,1184.6247794105625,"N/A",0.14638520972856156,0.13139278087658274,0.27986728870427247,183.5230768712415,"N/A",1.5981235532890372,1.578025707211512,3.0553804356518559,2003.5668375503963,57.428187679199858,32.367163848793524,"N/A",1.4643999999999999,17.825399999999998,1.6301000000000001,1.5395000000000001,1.3902000000000001,13.815099999999999,1.4134,1.4187000000000001,2.7252000000000001,77.146500000000003,1.4945999999999999,2.4689000000000001,2105.0715,7764.2564000000002,1623.9284,1978.1152999999999,"N/A","N/A",0.1414,0.40989999999999999,0.14199999999999999,0.14360000000000001,0.12889999999999999,0.40079999999999999,0.1229,0.1285,0.26319999999999999,1.7738,0.13020000000000001,0.2303,203.31780000000001,178.52529999999999,141.42769999999999,184.52010000000001,"N/A","N/A",1.7825,2.0011999999999999,3.0577999999999999,1990.4897000000001,47.482300000000002,29.739000000000001,null,"N/A",16184772.969000001,137304.92800000001,4944894.665,13579266,1656539,564278.14104000002,321687,21077,0,398527.50896000001,0,35244766.07096,2563581.1410400001,907042.14104000002,22229778.212000001,15578569,42.807406730181299,0.36316035511973072,13.07884377297122,35.916052938939565,4.3814107787135184,1.4924697392244211,0.85083592307335698,5.574694889944929E-2,0,1.0540728128774464,0,93.219536610089264,6.7804633899107456,2.3990526111972272,58.795953410374125,41.204046589625889,null,6418.8997069743164,10917.24742036711,10787.386848370448,10353.601603007704,43491.070453319509,11482.392770298888,null,2014.4515857308811,null,10.884748180484848]
[59,23,"ME",23,5527.7999999999984,90118939.879964203,38873121.093610123,14420135.401999999,6029171.2533333339,4536.4426308429101,1581.9366793043832,9937.7916085627148,4056809.2873712117,1951507.8739680941,277885.69781915983,4120372.4032098469,"N/A",0.62918169689498604,0.52476090422204602,1.3783215388094614,562.65897292594809,135.33214630546604,19.270671881528834,571.4748562816369,"N/A",0.10067678640883523,8.138974359660657E-2,0.22054834692462125,90.032334884870224,"N/A",0.92494818428733117,0.77144114004030173,2.0262445824114872,827.15437837616116,198.94924410339405,28.329452453528713,"N/A","N/A",2.8428,0.39129999999999998,0.41349999999999998,"N/A",2.8466999999999998,0.3493,0.37109999999999999,"N/A",11.0528,2.5899999999999999E-2,0.12559999999999999,"N/A",2642.5594000000001,1037.9423999999999,1052.4485,"N/A","N/A","N/A",0.18890000000000001,4.2900000000000001E-2,4.4999999999999998E-2,"N/A",0.18210000000000001,3.9199999999999999E-2,4.1399999999999999E-2,"N/A",0.73429999999999995,2.8E-3,1.37E-2,"N/A",175.56190000000001,113.69929999999999,114.6161,"N/A","N/A",0.56310000000000004,0.41060000000000002,1.1113,771.62329999999997,105.8023,15.0206,null,"N/A",45257.737999999998,83765.322,6043695.3329999996,0,3732604.3200000003,3218272.3316740002,878457,0,0,328033.40732600004,90049.95,6590801.7503260002,7829333.6516739996,4096729.3316740002,9809074.0820000004,4611061.32,0.31385099195201027,0.58089136935830843,41.91150196940432,0,25.884669012763272,22.317906468670483,6.0918776107897195,0,0,2.274828898489424,0.62447367857246705,45.705546907776537,54.29445309222347,28.409784079460202,68.023453376447023,31.976546623552991,null,6249.5210597998384,9187.3034219749316,6732.2418054706095,"-",15052.009576109622,9128.8372048024921,null,1053.0128877434208,null,225.85850936725967]
[60,24,"MI",26,34036.699999999983,783043434.36280441,370652086.40541631,108166077.441,48953481.986916661,71122.962468443715,31489.241879653793,204752.48119482098,71154710.416618317,3027319.2556269309,2247953.6437423979,71534912.404627502,"N/A",1.3150696438490761,1.2864965106289938,3.7858908456120126,1315.656666119379,27.987695655120756,20.782427327722605,1322.686633314345,"N/A",0.18165777106941577,0.16991266492001403,0.52296583359117677,181.73885967007672,"N/A",1.8103641364303142,1.7710295081168812,5.2117703753508628,1811.1722488146379,38.52869748179819,28.609709970916327,"N/A",2.3235000000000001,7.0883000000000003,0.48549999999999999,1.8089999999999999,2.2496,6.4352,0.48099999999999998,1.7088000000000001,7.3186,30.316700000000001,0.13100000000000001,5.3183999999999996,2258.036331798985,1537.3142,931.89959999999996,1875.6358,"N/A","N/A",0.21460000000000001,0.97660000000000002,6.2100000000000002E-2,0.1817,0.20549999999999999,0.97119999999999995,6.0499999999999998E-2,0.1709,0.67579999999999996,4.1769999999999996,1.67E-2,0.53420000000000001,208.52078617054829,211.64252279413412,119.12439999999999,188.39230000000001,"N/A","N/A",1.9277,1.9823,5.6658999999999997,1870.3105,34.981299999999997,29.261600000000001,null,"N/A",53136431.642000005,325142.76899999997,21748357.900000006,28019714,441574,2660164.5679599997,1131688,0,0,703004.56203999999,0,103932650.87304002,4233426.5679599997,3791852.5679599997,78573101.441,29592976,49.124857717969547,0.30059587690729705,20.106449650873962,25.904345117149656,0.40823704662939253,2.459333490586276,1.0462503834599046,0,0,0.64993071642397227,0,96.086179079324452,3.913820920675573,3.5055838740461804,72.641167452761053,27.358832547238954,null,7239.2699530952423,9965.7951640204265,9927.7438621429847,{"$f":"1000*AX66/BP66","v":10828.830896274036},7263.7302735960775,7822.9111752084382,null,1877.4790722786854,null,66.306823464047511]
[61,25,"MN",27,18009.399999999991,334432923.96958995,147669235.45973057,52193624.220999986,22379983.305416681,30490.583588642054,12141.840552061905,29425.861548868088,30282137.121824566,2382107.5115780029,1112529.7473507987,30479565.64012986,"N/A",1.1683642990392009,1.0850625209468487,1.1275653679182009,1160.3768687762677,45.639818026270866,21.315433905108566,1167.9421038505495,"N/A",0.18234199687477282,0.16444644701059602,0.17597466899846134,181.09543021295431,"N/A",1.901300089086233,1.765741617949897,1.8349072598644138,1888.3020011756614,74.270490933852813,34.686986255932204,"N/A",2.1981999999999999,17.810600000000001,0.25019999999999998,1.7672000000000001,2.2846000000000002,20.498799999999999,0.27760000000000001,1.7142999999999999,2.3668999999999998,1.7659,8.8999999999999999E-3,1.8385,2274.9929198096465,1638.5601999999999,951.29110000000003,1984.1572000000001,"N/A","N/A",0.2009,1.7357,3.1300000000000001E-2,0.1719,0.2074,1.7434000000000001,3.3500000000000002E-2,0.1676,0.21629999999999999,0.1721,1.1000000000000001E-3,0.17879999999999999,208.03368003102509,159.68289999999999,118.8295,192.9589,"N/A","N/A",1.9248000000000001,1.591,1.7537,1622.3372999999999,75.970500000000001,26.558800000000002,null,"N/A",22722774.436999995,29593.481,7088204.7849999992,11943790,561021.54,1847874.5697100002,7615408,0,0,261876.79528999998,123080.613,42169320.11129,10024304.10971,9463282.5697100013,32073404.681000002,20120219.539999999,43.53553671763904,5.6699417681160241E-2,13.580595122091704,22.883618791113655,1.0748851959858237,3.5404220291077468,14.59068634083463,0,0,0.50174096778785182,0.2358154177583989,80.794006434071832,19.205993565928203,18.131108369942382,61.45080967206593,38.549190327934106,null,6407.5436216792095,10427.110164818423,8407.6831905654508,10935.695217574219,10261.337939128111,8005.512940810152,null,2012.0037075821815,null,123.70170640652009]
[62,26,"MO",29,24141.299999999992,781693746.51192474,369083252.35121882,91804321.409999982,42103670.934416652,72777.435424339841,35742.013618675323,148577.63430234761,79170368.744749248,1817465.0067900142,2562970.0340898982,79586487.817467287,"N/A",1.5854904062590764,1.6978098500888128,3.236833125508261,1724.7634431318927,19.797161820663959,27.917749346935661,1733.8287913927797,"N/A",0.1862044713779212,0.19367995372850624,0.38014282438699554,202.56109019171103,"N/A",1.8402886236400304,1.9706585040741507,3.7570124385355022,2001.9437079754709,22.97868945476003,32.404306149049255,"N/A",1.9509000000000001,62.314500000000002,0.34560000000000002,1.8413999999999999,2.0951,40.113,0.373,1.9282999999999999,4.0418000000000003,15.116899999999999,8.6999999999999994E-3,3.7593000000000001,2081.6862863828387,7176.3558999999996,959.10509999999999,2013.1523,"N/A","N/A",0.1948,1.415,4.2799999999999998E-2,0.18629999999999999,0.20699999999999999,1.3843000000000001,4.4600000000000001E-2,0.1938,0.40350000000000003,0.34329999999999999,1.1000000000000001E-3,0.38040000000000002,207.81332855442056,162.95840000000001,118.782,203.70699999999999,"N/A","N/A",2.1375999999999999,2.4708000000000001,4.4585999999999997,1963.4496999999999,23.414899999999999,30.092600000000001,null,"N/A",72775009.308999985,67182.751000000004,6177744.4959999993,10718329,747713,53800.896999999997,1244778,0,0,19763.957000000002,0,89758029.512999997,2046291.8969999999,1298578.8969999999,79093501.409999982,12710820,79.271877610189293,7.3180379712149343E-2,6.7292523936973137,11.675190051383009,0.81446383842945524,5.8603882882292742E-2,1.3559034922123065,0,0,2.1528351494189215E-2,0,97.771028786475952,2.2289712135240545,1.4145073750945991,86.154442617975235,13.84555738202477,null,8514.7815974899968,9883.1602164105625,9638.5971027014293,10017.097078726125,44037.96244931221,8074.4986614133459,null,2013.2689182043464,null,11.325210228875449]
[63,27,"MS",28,19469.199999999997,392585299.97616708,196808898.7063441,54584295.177999996,26312178.820583336,20935.076725243067,11216.497340758571,39046.527282543488,26741086.989681132,1190006.0611714618,445222.38160010549,26822591.522471454,"N/A",0.76707326372809415,0.85257077471548615,1.430687239075354,979.8088223903286,21.801253589349077,8.1566021902129613,982.79519539467105,"N/A",0.10665237198903772,0.11398364011471408,0.19891996610629034,136.23070956199592,"N/A",0.88542570502752993,0.98411470583586036,1.6514292926538747,1130.9844292326577,25.164989112012488,9.4150918646258859,"N/A",2.8653,3.8921999999999999,0.58830000000000005,0.87749999999999995,3.0186000000000002,3.9514999999999998,0.64080000000000004,0.96330000000000005,10.39,2.1253000000000002,0.35720000000000002,1.6314,2491.7824999999998,2047.1188999999999,977.37049999999999,1169.7098000000001,"N/A","N/A",0.23849999999999999,0.31,7.51E-2,0.10489999999999999,0.24859999999999999,0.31,8.0199999999999994E-2,0.11260000000000001,0.86480000000000001,0.16930000000000001,4.5600000000000002E-2,0.19489999999999999,207.40289999999999,163.04490000000001,124.6815,139.76329999999999,"N/A","N/A",1.4354,1.7769999999999999,2.7879,1284.9826,24.881,11.549300000000001,null,"N/A",7211973.0099999998,17082.406000000003,38549893.025000006,7296134,0,1509189.929,0,0,0,22.808,0,53075105.248999998,1509189.929,1509189.929,47288161.178000011,7296134,13.212542154261909,3.129545951687035E-2,70.624513698103769,13.366727510554503,0,2.7648793926504225,0,0,0,4.1784912538712575E-5,0,97.235120607349572,2.7648793926504225,2.7648793926504225,86.633272489445531,13.366727510554503,null,7192.275703037697,8301.9785543873186,9193.9915557231416,12014.212433866644,12555.553102243613,7838.9376130380206,null,1160.311919290401,null,29.327490057743262]
[64,28,"MT",30,6693.6000000000013,172291037.29571748,58219694.960698292,27795017.083000001,11079987.310333334,18086.674791959333,6045.4897605994738,25992.626258967717,17863470.426688369,400813.39199480537,583315.90700037323,17958092.93288938,"N/A",1.301432896259777,1.0912448888748048,1.8703083492519483,1285.3721495004249,14.420332637246373,20.986348209771066,1292.1807444308367,"N/A",0.20995491205866576,0.20767851032818133,0.30172929093641015,207.36389666083215,"N/A",2.3705359037730509,1.987682343300937,3.4067319996061172,2341.281551171493,26.266368676544854,38.226244367512365,"N/A",2.5182000000000002,1.01,0.98770000000000002,2.4247999999999998,2.5489000000000002,1.5456000000000001,0.98329999999999995,2.4386000000000001,2.0935000000000001,49.846699999999998,8.8999999999999999E-3,3.4845999999999999,2445.2739999999999,1850.2998,1402.7313999999999,2394.8276999999998,"N/A","N/A",0.2162,0.12280000000000001,8.3599999999999994E-2,0.21,0.215,0.18179999999999999,8.3400000000000002E-2,0.2077,0.1797,6.0621,8.0000000000000004E-4,0.30170000000000002,209.92570000000001,225.02209999999999,118.759,207.3639,"N/A","N/A",2.8643999999999998,2.2281,2.9651999999999998,2401.4203000000002,27.715,37.9589,null,"N/A",13987391.560000002,466986.30599999998,463998.34700000001,0,11283465,0,1251985.8700000001,0,0,0,341190,15259566.213,12535450.869999999,1251985.8700000001,15259566.213,12535450.869999999,50.323378173258888,1.6801080013928769,1.6693580205920826,0,40.59527996081426,0,4.5043536626057348,0,0,0,1.2275221813361603,54.900366376580003,45.099633623419997,4.5043536626057348,54.900366376580003,45.099633623419997,null,6198.6303797270984,11290.690370276612,11580.705706248775,11648.283178286412,8222.7470101825566,11811.57975395549,null,2341.2815888730024,null,3.7701509427279234E-5]
[65,29,"NC",37,39311.999999999978,693049929.32275355,338520954.97893739,116971226.61099999,53386069.388999991,48807.764638213521,23611.013552750868,60973.285073392421,61760659.600209154,2669867.8868980445,1970797.9552705868,62094166.896088503,"N/A",0.83452599502147373,0.88453837575897021,1.0425347641461509,1055.9974686014136,22.824996918062325,16.848570476435892,1061.6998503843877,"N/A",0.14084920169000906,0.1394951373348213,0.17595639936930763,178.22860081830322,"N/A",1.3293912683969036,1.4090604730242067,1.6607470836429197,1682.193032431338,36.359983733373703,26.83959829887311,"N/A",1.696,-299.10359999999997,0.39389999999999997,1.3255999999999999,1.6919999999999999,-234.0642,0.53359999999999996,1.3486,1.9739,-68.815299999999993,0.73740000000000006,1.6211,2020.0652,-29548.528600000001,1057.5748000000001,1745.3364999999999,"N/A","N/A",0.17130000000000001,1.643,4.6300000000000001E-2,0.13950000000000001,0.17030000000000001,1.6096999999999999,5.74E-2,0.1384,0.19939999999999999,0.378,8.6599999999999996E-2,0.1706,204.04320000000001,162.31020000000001,124.23520000000001,183.62610000000001,"N/A","N/A",1.8482000000000001,2.0952999999999999,2.9540000000000002,1876.7714000000001,45.954500000000003,31.264900000000001,null,"N/A",50932179.933999993,178260.76799999998,19302008.052000001,39385592,4045467,2564428.5920000006,0,111425,0,140831.26500000001,311034,110249906.01899999,6721320.5920000002,2675853.5920000006,73428742.611000001,43542484,43.542485968263179,0.15239710924193756,16.501500934234741,33.671179777383109,3.4585146426254232,2.1923584682310597,0,9.5258469307631918E-2,0,0.12039821166306915,0.26590641904985401,94.253868419835896,5.7461315801641142,2.2876169375386914,62.77504711068385,37.224952889316164,null,{"$f":"F71*1000000/(H71*1000)","v":5924.9607737085917},{"$f":"(F71*((CT71+CU71+CV71+DC71)/DH71)*1000000/((CD71+CE71+CF71+CM71)*1000))","v":9438.401158444065},{"$f":"1000*BY71/BS71","v":10220.61351844863},9900.1838826287767,-182049.73316526011,8512.682395971513,null,{"$f":"DL71*BS71/1000","v":1733.1367949605658},null,{"$f":"DR71-AH71","v":50.943762529227797}]
[66,30,"ND",38,7390.5999999999995,308021928.873528,128793698.12294774,36125158.886,14866769.334333329,48794.92763333836,20763.766842517714,86794.796838511786,33454500.190810263,719669.81013743568,1074306.0260945342,33628574.157861359,"N/A",2.7014373991998371,2.7933125718935932,4.8052271333897645,1852.1441135460459,19.921568024337123,29.738444320334118,1861.7813842138603,"N/A",0.31682762205786508,0.32243451574309823,0.56356245255609194,217.221548564138,"N/A",3.4394815873016937,3.5564574479690321,6.1180356254015074,2358.1577635142507,25.364225145539642,37.863113801964275,"N/A",3.4516,1.5389999999999999,"N/A",3.4477000000000002,3.5087999999999999,1.5099,"N/A",3.5036999999999998,6.1451000000000002,0.20380000000000001,"N/A",6.1327999999999996,2366.3836000000001,1146.3097,"N/A",2363.8454999999999,"N/A","N/A",0.31709999999999999,0.18490000000000001,"N/A",0.31690000000000002,0.32269999999999999,0.18279999999999999,"N/A",0.32250000000000001,0.5645,2.4500000000000001E-2,"N/A",0.56359999999999999,217.37809999999999,137.74610000000001,"N/A",217.25139999999999,"N/A","N/A",5.2493999999999996,5.7168999999999999,15.0314,2467.3081000000002,27.739699999999999,39.7742,null,"N/A",28214364.162,68044.895999999993,21696.668000000001,0,2477230,5543,5274509,0,0,1044.1600000000001,62727,28367876.886,7757282,5280052,28373419.886,7751739,78.101702614058908,0.18835874525764432,6.0059716466488298E-2,0,6.8573539228363911,1.5343877150802354E-2,14.600652738012155,0,0,2.8903955918783671E-3,0.17363799062572238,78.526649462000648,21.473350537999348,14.615996615162956,78.541993339151446,21.458006660848547,null,8526.5210831473814,10856.002910862077,11356.926123375961,10886.025777205708,8321.903124661967,"-",null,2358.4818307888609,null,0.32406727461011542]
[67,31,"NE",31,9084.0999999999967,270920986.94039893,116765526.64662038,34200814.916000001,15059970.391333336,28440.445029082144,11834.003636309524,63840.559222967633,28008190.743194204,628879.98996336886,918519.83833280287,28157164.558030412,"N/A",1.6631442905050189,1.5715839180028826,3.7332770800792479,1637.866864399846,18.387865654895929,26.856665275045717,1646.5785758138636,"N/A",0.20995379760179952,0.20269687426022573,0.47128544705185349,206.76279870009364,"N/A",2.1982926413816033,2.0772709752142702,4.9345300827054386,2164.8817220059941,24.304511635365689,35.498308825781152,"N/A",2.2412999999999998,25.576899999999998,0.70030000000000003,2.2035,2.1989000000000001,19.980899999999998,0.66349999999999998,2.1111,5.0846999999999998,2.0760000000000001,2.1399999999999999E-2,4.9466999999999999,2196.3982999999998,2096.3017,1232.5847000000001,2170.2174,"N/A","N/A",0.214,1.9725999999999999,6.7599999999999993E-2,0.21049999999999999,0.2114,1.5916999999999999,6.4699999999999994E-2,0.20319999999999999,0.48549999999999999,0.16009999999999999,2.0999999999999999E-3,0.47249999999999998,209.7251,161.67580000000001,119.0595,207.28110000000001,"N/A","N/A",3.2078000000000002,3.0937999999999999,5.2766999999999999,2315.6138000000001,26.889900000000001,36.424100000000003,null,"N/A",25019215.579999994,22582.715,770100.41500000004,5801578,1257054,63132.206000000006,1267152,0,0,0,0,31613476.710000005,2587338.2060000002,1330284.206,25875030.916000001,8325784,73.153858004404967,6.6029757055394725E-2,2.251701945966579,16.963274162469958,3.6755089113736834,0.18459269510114851,3.7050345236282496,0,0,0,0,92.43486386989693,7.5651361301030819,3.8896272187293981,75.656182402528103,24.343817597471894,null,7921.4775322109444,10470.363796662097,11171.369700373069,10472.748850757491,12966.082122370817,{"$f":"1000*AZ73/BR73","v":10352.678282707388},null,2170.308525172296,null,5.4268031663018519]
[68,32,"NH",33,4720.9000000000005,86908731.233999535,37243002.793253951,19264434.942000002,8221085.2513333336,3598.8798443857681,1248.7556832450407,3324.0526782252668,4920946.2916415073,1441319.1634096364,235472.10850020629,4972578.3196748421,"N/A",0.37362942180458664,0.30379339103496383,0.34509734526167929,510.88405203237409,74.817619501898619,12.223151585247587,516.24439903334087,"N/A",8.2819753396143281E-2,6.7059881834836119E-2,7.649525268699045E-2,113.24400257074252,"N/A",0.75155400644612924,0.61107912503634598,0.69416185479361614,1027.6411163764783,150.4953261384826,24.586817871360704,"N/A",3.0918999999999999,12.0481,8.77E-2,0.52200000000000002,3.2372000000000001,12.0488,9.3299999999999994E-2,0.35880000000000001,1.6931,31.207799999999999,3.2300000000000002E-2,0.27560000000000001,2353.3002000000001,6118.0293000000001,886.93219999999997,1098.8306,"N/A","N/A",0.26960000000000001,0.32540000000000002,1.18E-2,6.5000000000000002E-2,0.27029999999999998,0.32550000000000001,1.2500000000000001E-2,4.5699999999999998E-2,0.14760000000000001,0.84299999999999997,4.3E-3,3.4299999999999997E-2,205.19159999999999,165.26070000000001,119.0244,136.7696,"N/A","N/A",0.92249999999999999,0.73099999999999998,0.82699999999999996,1271.9694999999999,36.381399999999999,14.041700000000001,null,"N/A",1267717.1570000001,21649.863000000001,7049703.7110000001,8189181,1289386,1174859.5299999998,208699,0,0,63238.680999999997,0,16591490.412,2672944.5300000003,1383558.5299999998,9577168.9419999998,9687266,6.5806090903613486,0.11238254880136313,36.594396525123884,42.509323656029402,6.6930901626857588,6.0985932550691668,1.0833382895908248,0,0,0.32826647233824685,0,86.124978292654248,13.875021707345752,7.1819315446599905,49.714247891694008,50.285752108305978,null,4511.3563670908698,9074.5743089972475,9300.0893473403448,11468.79404420064,37020.473107036334,7451.6838564193558,null,1241.1258984118299,null,213.4847820353516]
[69,33,"NJ",34,23680.200000000015,259579008.99183065,140242511.93762118,65232564.118000001,31693909.222999994,6494.4816978319759,3744.450053889776,12195.680336465117,16860463.944955885,1436774.7212092741,287520.79347900301,16920115.802517824,"N/A",0.19911778068646901,0.23628830558853631,0.37391387266041537,516.93396305737053,22.025421515092898,4.4076267331589642,518.7628611964667,"N/A",5.0038573789580709E-2,5.3399643263025404E-2,9.3965073553762851E-2,129.90622015577932,"N/A",0.40599758630006866,0.48178762041815909,0.76240368520015322,1054.0190863632063,44.909439737327219,8.9870719169571398,"N/A",1.3452999999999999,1.0468999999999999,0.23980000000000001,0.34870000000000001,1.3381000000000001,1.1223000000000001,0.26200000000000001,0.3906,1.7403999999999999,0.1067,6.4000000000000003E-3,0.15629999999999999,1891.1404,2013.0431000000001,898.99310000000003,1003.6994,"N/A","N/A",0.12520000000000001,7.7499999999999999E-2,3.1600000000000003E-2,4.3799999999999999E-2,0.125,8.4699999999999998E-2,3.44E-2,4.8599999999999997E-2,0.16200000000000001,7.9000000000000008E-3,8.0000000000000004E-4,1.9699999999999999E-2,176.01840000000001,148.9657,118.6403,126.18389999999999,"N/A","N/A",0.46779999999999999,0.69540000000000002,0.43059999999999998,1061.9217000000001,25.793399999999998,7.6651999999999996,null,"N/A",1897474.8929999999,320377.17200000002,28284904.463000003,33110224,-155421,983045.92600000009,11568,273482.23999999999,0,506908.424,0,64119888.952,1112675.1660000002,1268096.1660000002,31992710.878000002,33239853.239999998,2.9087847743768491,0.49113073559467285,43.360099124472683,50.7572014800867,-0.23825676960797831,1.5069864864146012,1.7733474310582826E-2,0.41924189811900475,0,0.77707879623288612,0,98.294294910763782,1.7057050892362107,1.9439618588441889,49.044079917091693,50.955920082908307,null,3979.2856911507411,8113.6922088816118,8415.6671334457114,10743.992673493225,13513.467194125897,7577.4681958828496,null,1023.8173263162963,null,-30.201760046909953]
[70,34,"NM",35,9965.0999999999985,344387639.48023301,161225768.69653401,36635909.329999998,16583901.394333325,60305.344027107378,27327.215473113229,16564.056586175389,32310828.173864499,800732.56424862181,952779.58039987017,32466916.700751089,"N/A",3.2921439718557894,3.2956316880237679,0.90425251558375286,1763.8884233948124,21.856494867807939,26.006713026218485,1772.4094908251641,"N/A",0.35021781918841927,0.3389931484780162,9.6194257210709927E-2,187.64220587376255,"N/A",3.5627237675542287,3.5664981375065659,0.97857261306980825,1908.8615999378696,23.652870107339687,28.144192783355418,"N/A",4.5768000000000004,42.758800000000001,0.65700000000000003,3.5627,4.5831999999999997,45.065600000000003,0.7056,3.5104000000000002,1.3180000000000001,3.5783999999999998,6.1000000000000004E-3,0.97860000000000003,2214.0171999999998,2859.5560999999998,1034.4724000000001,1908.8616,"N/A","N/A",0.42859999999999998,2.4380000000000002,7.5300000000000006E-2,0.35020000000000001,0.4209,2.4380000000000002,7.8700000000000006E-2,0.33900000000000002,0.1234,0.20399999999999999,6.9999999999999999E-4,9.6199999999999994E-2,207.3287,163.04490000000001,118.58750000000001,187.6422,"N/A","N/A",2.649,3.0019999999999998,0.64480000000000004,1682.104,23.155200000000001,20.575500000000002,null,"N/A",24994048.800000001,46148.929999999993,8799041.2919999994,0,222819,14266.308000000001,2225788,333797,0,0,0,33839239.022,2796670.3080000002,2573851.3080000002,33853505.329999998,2782404,68.222815420970477,0.12596638337624141,24.01753212331143,0,0.6081983607747945,3.8940777671151644E-2,6.0754271989022852,0.91111973499362309,0,0,0,92.36631392765814,7.6336860723418551,7.0254877115670604,92.405254705329298,7.5947452946707035,null,9400.2754613824945,10172.879768968758,8964.4227151461655,10678.778191345433,17538.457811314547,8723.283651312322,null,1908.8615401847896,null,-5.9753079995061853E-5]
[71,35,"NV",32,17929.000000000004,237416383.844971,117896224.99787332,35142773.975999996,17191094.307999998,9756.6505302813293,5038.8426343756228,4876.1808020573881,16119342.439513275,551201.68556107173,201328.52598244612,16156335.978738947,"N/A",0.55525784828166524,0.58621546064473173,0.27750688123751821,917.36312281561118,15.684637926917866,5.7288740530254989,919.46845116851443,"N/A",8.2190204165962372E-2,8.5479287135216006E-2,4.1077037086382835E-2,135.78963825882329,"N/A",0.65517858507605731,0.69170713614136015,0.32744528755555152,1082.4460647738529,18.507147474258652,6.7598064714542891,"N/A",2.0916000000000001,-1.4678,0.42409999999999998,0.65590000000000004,2.2025999999999999,-1.4413,0.46500000000000002,0.68410000000000004,2.2452000000000001,-0.14710000000000001,7.1999999999999998E-3,0.31809999999999999,2274.5965000000001,-98.162099999999995,889.43899999999996,1081.9097999999999,"N/A","N/A",0.19270000000000001,2.4380000000000002,5.6500000000000002E-2,8.2299999999999998E-2,0.20710000000000001,2.4380000000000002,6.1100000000000002E-2,8.5599999999999996E-2,0.2069,0.24440000000000001,1E-3,3.9899999999999998E-2,209.60239999999999,163.04490000000001,118.46639999999999,135.7012,"N/A","N/A",0.96230000000000004,1.1531,0.52610000000000001,1205.5531000000001,19.598099999999999,9.3329000000000004,null,"N/A",4079431.7419999996,18874.694,25646658.295999996,0,2440415,18961,128788,451295,2339097,7324.2439999999997,11929,29764217.976,5378556,2938141,29783178.976,5359595,11.608166574402921,5.370860596516959E-2,72.978468670443689,0,6.9442867591119279,5.395419272522143E-2,0.36647078596570948,1.2841758032766628,6.655982824797599,2.0841394037368639E-2,3.3944389273728517E-2,84.695129634122893,15.30487036587712,8.3605836067651929,84.749083826848107,15.250916173151898,null,6755.7667475854196,7971.4923660864679,8883.8794351118486,10851.958279103676,-602.05563007490559,7507.943180513631,null,1081.7410798687729,null,-0.70498490507998213]
[72,36,"NY",36,48055.80000000001,626602859.31834841,312775128.33280444,135662526.46399996,61229371.946000054,23118.183352218646,11030.943577942611,34220.298294532819,38169117.104947455,3324160.7148349192,561770.01984817896,38289788.020189852,"N/A",0.3408190007187194,0.36031542468445105,0.50449153773667454,562.70685943735816,24.503160905801305,4.1409373280192661,564.4858461389573,"N/A",7.3788949438781129E-2,7.053593830648372E-2,0.10922483926025955,121.82873581671757,"N/A",0.68286066941750012,0.72192345961526416,1.0107929089864505,1127.4323964066145,49.094225450151626,8.2967300234556447,"N/A",2.8713000000000002,4.3827999999999996,0.39050000000000001,0.58150000000000002,2.5659999999999998,4.5175999999999998,0.40660000000000002,0.57720000000000005,7.6875,4.5387000000000004,4.2999999999999997E-2,0.60329999999999995,2126.8416999999999,2121.4994999999999,1026.4395761204876,1151.6778999999999,"N/A","N/A",0.2782,0.32979999999999998,4.3299999999999998E-2,6.3700000000000007E-2,0.24859999999999999,0.32619999999999999,4.5199999999999997E-2,6.3399999999999998E-2,0.74480000000000002,0.34150000000000003,4.7999999999999996E-3,6.6100000000000006E-2,206.07079999999999,159.64580000000001,113.73781119496645,126.1113,"N/A","N/A",0.91920000000000002,1.2257,1.3153999999999999,1222.8000999999999,33.357500000000002,8.1737000000000002,null,"N/A",4551039.0880000005,580248.12899999996,59462256.118000031,40774560,24150828,2179706.9232859998,2974614.7,52713,0,936560.50571399997,0,106304663.84071399,29357862.623285998,5207034.6232860005,67709810.763999999,67952715.700000003,3.3546766425639918,0.42771437634546583,43.831010425549763,30.055875460066808,17.802136396456376,1.6067126126126046,2.1926576023109505,3.885597694068315E-2,0,0.69036050715341069,0,78.359637411679415,21.640362588320613,3.8382261918642384,49.910474564225211,50.089525435774817,null,4618.8352498700269,9254.2402976482845,9696.1977237567116,10320.927079430952,13288.789933715763,9024.6116514497626,null,1167.0642744488121,null,39.631878042197513]
[73,37,"OH",39,39660.300000000003,1102935989.590631,508904734.08709943,129741418.34499998,57367098.94675,87353.24874601746,40997.477973231064,348748.84303774446,104821036.43337192,2645130.2875488224,3182766.7321161074,105342121.20354696,"N/A",1.3465745921434795,1.4293028138406041,5.376060281850382,1615.8453910938233,20.387709039183331,24.531616601051024,1623.8780575595065,"N/A",0.15840130265118965,0.16112044250000754,0.63240087607837903,190.0763732848678,"N/A",1.5707844679748946,1.6672872584353731,6.2711951041532235,1884.8898960277968,23.782341418876449,28.616225611317766,"N/A",1.913,2.2210000000000001,0.13950000000000001,1.5697000000000001,1.9669000000000001,2.6555,0.18210000000000001,1.6327,7.9715999999999996,6.2946999999999997,5.7999999999999996E-3,6.2497999999999996,2120.7523592509392,3226.0215262546935,991.97389999999996,1898.4974999999999,"N/A","N/A",0.1875,0.14599999999999999,1.67E-2,0.15840000000000001,0.19209999999999999,0.18060000000000001,1.9699999999999999E-2,0.16120000000000001,0.78129999999999999,0.4138,6.9999999999999999E-4,0.63060000000000005,207.84633641388982,212.1003,118.8023,191.5634,"N/A","N/A",1.7101999999999999,1.9423999999999999,7.758,1607.4683,19.939800000000002,24.6599,null,"N/A",85588636.420000002,1281953.1170000001,22664563.645999998,17086998,414161,716500.2159999999,985485,32324,0,970796.946,0,127592948.12900001,2148470.216,1734309.216,111222450.34499998,18518968,65.968630150479967,0.98808316831492715,17.469027188936579,13.170041007693751,0.31922034249594056,0.55225249202589177,0.75957624987531902,2.491417190618813E-2,0,0.74825522827145263,0,98.344036743696691,1.6559632563033395,1.336742913807399,85.726248228028794,14.273751771971197,null,8501.0323122703576,9916.4870596668516,8391.3122235249539,10203.462788142821,15209.886672742536,8349.7869990732488,null,1899.6359772057849,null,14.746081177988117]
[74,38,"OK",40,25816.9,655725199.76160061,339105875.34507084,77757667.676699996,38568958.680033334,68415.00517442108,33251.208594271891,78711.17035773606,53328418.314968191,1589071.7778643279,1225751.5854896256,53535095.064386658,"N/A",1.7596979749669517,1.7242471527490641,2.0245249815105191,1371.6568386977995,20.436206812058117,15.76373908983539,1376.9727581587017,"N/A",0.20866974518988884,0.19611107333623037,0.24007364788284105,162.65477774639922,"N/A",1.9914569080543296,1.9513370773752361,2.2911626411534662,1552.3092745253614,23.127733173111384,17.839883635604195,"N/A",3.1608999999999998,28.584199999999999,0.94230000000000003,1.9991000000000001,2.9274,28.029699999999998,1.0424,1.8789,4.8080999999999996,1.7669999999999999,6.1999999999999998E-3,2.2923,2175.3431999999998,1977.4247,1002.1874,1560.7302,"N/A","N/A",0.29249999999999998,2.2269999999999999,0.11169999999999999,0.20899999999999999,0.2722,2.2002000000000002,0.1208,0.1963,0.44490000000000002,0.13769999999999999,6.9999999999999999E-4,0.23960000000000001,201.27510000000001,154.05860000000001,118.7834,163.15639999999999,"N/A","N/A",2.0167999999999999,2.6444000000000001,1.6495,1466.5252,23.502800000000001,13.894299999999999,null,"N/A",29301757.463000003,10693.525999999998,39022848.611699998,0,1028804,363487.80499999999,8020367,0,0,9709.2709999999988,0,68345008.871700004,9412658.8049999997,8383854.8049999997,68708496.676699996,9049171,37.68343153607762,1.3752374935500158E-2,50.185209738991638,0,1.3230900961144441,0.46746232990334241,10.314567347039004,0,0,1.2486576938455899E-2,0,87.894880226943215,12.10511977305679,10.782029676942347,88.362342556846556,11.637657443153449,null,8432.9329743783965,9543.5824021451208,8988.4626039799859,10807.810802230379,12835.53595839505,8437.099796772949,null,1557.09654783735,null,4.7872733119886561]
[75,39,"OR",41,18972.099999999988,124560183.4828136,38163661.410057172,60612559.409999996,24166414.824583329,4522.9158826547682,1369.861833754097,14399.059881544341,7896254.3308378141,665314.39250338706,186427.85141050818,7932136.4489277294,"N/A",0.14924022105915455,0.11336905732170108,0.47511802905880102,260.54845423785463,10.976510462180253,3.075729736958623,261.73243717601764,"N/A",7.2622177588215014E-2,7.178880553599612E-2,0.23119843723626299,126.78617050893016,"N/A",0.59720300450705244,0.45366015387913466,1.9012429252360721,1042.6165184306417,43.923849619727157,12.307908866171585,"N/A",2.0480999999999998,"N/A",0.1331,0.48699999999999999,1.9802999999999999,"N/A",0.153,0.46729999999999999,8.6832999999999991,"N/A",7.3000000000000001E-3,1.6105,2079.5252999999998,"N/A",845.63689999999997,1073.6475,"N/A","N/A",0.20660000000000001,"N/A",1.8599999999999998E-2,6.3600000000000004E-2,0.19450000000000001,"N/A",2.1000000000000001E-2,6.0100000000000001E-2,0.87590000000000001,"N/A",1E-3,0.2104,209.76009999999999,"N/A",118.38330000000001,140.2508,"N/A","N/A",0.63759999999999994,0.52690000000000003,1.9016,1040.9882,47.476900000000001,13.6105,null,"N/A",2634334.5,5925.0130000000008,11624679.245999999,0,39407149,841357.03923500003,6035761,6412,16241,40700.611764999994,0,14305639.370765001,46306920.039234996,6899771.0392349996,15146996.41,45465563,4.3461858823360977,9.7752232502204463E-3,19.178664222653058,0,65.014824293162121,1.388090269450313,9.9579378576846675,1.0578665646879339E-2,2.6794776788984304E-2,6.7148809027663528E-2,0,23.601774137267039,76.398225862732971,11.383401569570843,24.989864406717356,75.010135593282655,null,2055.0226668412779,8223.4246388663123,7422.3334198450202,9913.826795467774,"-",7143.2110779138611,null,1153.3418843407114,null,110.72536591006974]
[76,40,"PA",42,54684.999999999978,1339016860.4616985,608470750.53745353,223416431.35199994,96651089.525000066,133396.36866954062,63111.562316542331,279451.58552985737,118496909.62076037,5293017.4783514561,3486416.0752296885,119092738.23529875,"N/A",1.1941500261399327,1.3059669089445227,2.501620707472247,1060.7716621707611,23.691263199939549,15.605011923839772,1066.1054562067034,"N/A",0.19924524120412496,0.20744320827516124,0.41739815797913299,176.990914931276,"N/A",1.8490555631873329,2.0221959766045869,3.8735800233480449,1642.5287445234928,36.68421978801701,24.163240363233356,"N/A",2.8315000000000001,4.0213000000000001,0.16059999999999999,1.8247,2.9457,6.3667999999999996,0.2001,1.9272,5.7084000000000001,0.85170000000000001,1.5900000000000001E-2,3.5478000000000001,2075.3644724223714,2313.7442999999998,908.29809999999998,1624.0361,"N/A","N/A",0.28129999999999999,0.26669999999999999,2.1100000000000001E-2,0.19939999999999999,0.29049999999999998,0.36170000000000002,2.5899999999999999E-2,0.20830000000000001,0.56720000000000004,5.6500000000000002E-2,2.0999999999999999E-3,0.38779999999999998,206.20685768690663,153.4324,119.0852,177.50049999999999,"N/A","N/A",2.0910000000000002,2.5526,4.9645000000000001,1592.1415999999999,28.059200000000001,22.762499999999999,null,"N/A",87148204.988999993,360589.26299999998,53063084.065000005,75174408,1798553,2327352.4674249999,2128658,28863,0,1386718.567575,0,217133004.88457498,6283426.4674250009,4484873.4674249999,144285949.35199994,79130482,39.007070546075965,0.16139782594230043,23.750752683627542,33.647663041202307,0.80502270540984544,1.0417105193835003,0.95277593824163687,1.2918924461077527E-2,0,0.62068781565585895,0,97.187571912503955,2.8124280874960603,2.0074053820862146,64.581619390685134,35.418380609314866,null,5993.3678662695738,9280.299755279937,8969.78656398151,10064.478435404379,{"$f":"1000*AY82/BQ82","v":15079.893816429905},7627.2962551181845,null,1647.2578467120663,null,4.7291021885735063]
[77,41,"RI",44,2052.2000000000003,64577922.063464828,32002765.074695088,8309035.8530000001,4060637.3760000002,762.17326546884965,380.0865855138544,35.623843802457081,3768286.0769127957,148274.53647108862,14972.990396654666,3772163.7730572242,"N/A",0.18345648735976147,0.18720538197294787,8.5747238145795195E-3,907.033293291723,17.844974927813521,1.8020129725699316,907.96666178670398,"N/A",2.3604762776969303E-2,2.3753359100485521E-2,1.1032824427966964E-3,116.70508918541732,"N/A",0.18358123103023466,0.18733267475400855,8.5805543117034918E-3,907.65004260309911,17.857108855068063,1.8032382751780527,"N/A","N/A",21.565300000000001,0.1583,0.18579999999999999,"N/A",21.566400000000002,0.15920000000000001,0.1893,"N/A",2.7841,5.1000000000000004E-3,8.6999999999999994E-3,"N/A",2596.8355999999999,916.61059999999998,918.77210000000002,"N/A","N/A","N/A",1.3540000000000001,2.0500000000000001E-2,2.4E-2,"N/A",1.3540000000000001,2.0299999999999999E-2,2.41E-2,"N/A",0.17480000000000001,6.9999999999999999E-4,1.1000000000000001E-3,"N/A",163.04490000000001,118.752,118.8694,"N/A","N/A",0.22750000000000001,0.2402,1.29E-2,915.14300000000003,18.087399999999999,1.8421000000000001,null,"N/A",0,17874.223000000002,8185000.6299999999,0,4266,100515,1380,0,0,0,0,8202874.8530000001,106161,101895,8303389.8530000001,5646,0,0.21511789473800941,98.507224842997672,0,5.1341696864381073E-2,1.2097071402539294,1.6608425146002314E-2,0,0,0,0,98.722342737735687,1.277657262264313,1.2263155653999318,99.932049877989613,6.795012201038339E-2,null,7772.0114831552683,7777.2961653887587,7698.7265015218381,"-",15927.119462184955,7718.6961061708434,null,924.48252880206246,null,16.832486198963352]
[78,42,"SC",45,26596.000000000011,436320176.45751494,202323522.97237694,96755682.344999999,44036779.978999995,21243.790134513605,9568.1540265431759,54472.957213884489,37176847.863072172,1684239.962470596,1197347.9079796779,37380121.308414966,"N/A",0.439122325834363,0.43455284564884089,1.1259898311636363,768.46851703265042,17.407142626157416,12.374962162018722,772.67030529802548,"N/A",9.7377069779316705E-2,9.4582714713301111E-2,0.24969258885138257,170.41085821385172,"N/A",0.942364527137318,0.93255833924625375,2.4163947319002701,1649.147465452598,37.356045831972182,26.556894696699572,"N/A",1.1741999999999999,120.6561,0.26669999999999999,0.86680000000000001,1.1586000000000001,127.081,0.27900000000000003,0.86399999999999999,3.1743999999999999,29.795000000000002,0.34449999999999997,2.2223000000000002,2128.3114,13174.5592,970.65380000000005,1733.2372,"N/A","N/A",0.11269999999999999,1.4932000000000001,3.32E-2,9.0300000000000005E-2,0.1101,1.4508000000000001,3.3599999999999998E-2,8.8400000000000006E-2,0.30480000000000002,0.36870000000000003,4.2900000000000001E-2,0.23150000000000001,204.3468,163.04490000000001,120.926,180.54929999999999,"N/A","N/A",1.3986000000000001,1.4913000000000001,4.3526999999999996,1757.9022,44.828499999999998,30.569800000000001,null,"N/A",28396145.238000002,108399.03499999999,14331878.864,51145302,524239,2143472.622,0,0,0,106245.58600000001,0,94087970.72299999,2667711.622,2143472.622,45086141.345000006,51669541,29.348297226356564,0.11203376625827875,14.812441519348784,52.860256638604561,0.54181727346072595,2.2153454660751168,0,0,0,0.109808109895977,0,97.242837260464157,2.7571627395358429,2.2153454660751168,46.597926087934731,53.402073912065283,null,4509.5044123789639,9677.4787870797063,9736.4110522721494,{"$f":"1000*AX84/BP84","v":10415.193191182832},80803.258488919295,8026.8412086730732,null,1747.26202077209,null,98.114555319491956]
[79,43,"SD",46,4432.8999999999996,33058791.540173933,14821756.032074122,12017721.954,5502070.9110000003,10849.689219663847,4559.751655238133,12403.145233780418,3358271.7836162243,77327.037431964578,107308.56083227885,3375716.5444382629,"N/A",1.8056149511850901,1.657467425991207,2.0641424857815309,558.88658374201293,6.4344172487887281,8.9291931734667962,561.78975638801217,"N/A",0.65638752744358564,0.61527819583197552,0.75036894308176894,203.16966393252227,"N/A",6.9137677950538103,6.3465053297479415,7.9036794822905598,2139.9978224743231,24.637626491415819,34.190217664076492,"N/A",7.3433999999999999,32.8658,0.64070000000000005,6.9138000000000002,7.1673,11.111000000000001,0.53459999999999996,6.3166000000000002,8.4738000000000007,2.6118999999999999,6.6E-3,7.9036999999999997,2197.4059000000002,5412.9472999999998,1303.8957,2139.9978000000001,"N/A","N/A",0.70050000000000001,0.92349999999999999,5.8500000000000003E-2,0.65639999999999998,0.69599999999999995,0.68820000000000003,5.3400000000000003E-2,0.61529999999999996,0.80830000000000002,7.3400000000000007E-2,5.9999999999999995E-4,0.75039999999999996,209.59950000000001,152.10470000000001,119.06740000000001,203.16970000000001,"N/A","N/A",5.6386000000000003,4.4476000000000004,6.0541999999999998,2001.1784,26.223400000000002,27.101900000000001,null,"N/A",2918755.929,5718.2969999999996,214100.728,0,5964481,0,2914666,0,0,0,0,3138574.9539999999,8879147,2914666,3138574.9539999999,8879147,24.287098171950266,4.7582204197166598E-2,1.7815416999953002,0,49.630712233401034,0,24.253065690456229,0,0,0,0,26.116222076142733,73.883777923857267,24.253065690456229,26.116222076142733,73.883777923857267,null,2750.8367781108955,10533.057844625218,9849.7876405782936,10483.831783949869,35586.982519277837,10950.904277745209,null,2139.9982023751522,null,3.7990082910255296E-4]
[80,44,"TN",47,25710.6,440443036.04707444,220682390.46052304,77385936.541000009,36276408.415250003,23869.568779612189,11456.371429471877,69210.214167879807,42463377.067161769,1126716.7170671199,1342973.9352504769,42683368.552654803,"N/A",0.61689681217376757,0.63161552810480592,1.7887026315488574,1097.4442893681116,14.559709004363755,17.354237672615788,1103.1298569357143,"N/A",0.10838890310919125,0.10382678387309985,0.31427543860851342,192.82119861976111,"N/A",1.074485446939508,1.1001218998331608,3.1154885364527991,1911.4832407672623,25.359501180979208,30.226896061026437,"N/A",1.2498,26.513300000000001,0.34670000000000001,1.079,1.1944999999999999,26.5916,0.44240000000000002,1.0350999999999999,3.6160000000000001,1.6698999999999999,1.0668,3.1337999999999999,2163.4632000000001,1773.1129000000001,1014.7624,1946.1862000000001,"N/A","N/A",0.1192,2.4380000000000002,4.41E-2,0.1081,0.1138,2.4380000000000002,5.4300000000000001E-2,0.10349999999999999,0.34499999999999997,0.15359999999999999,0.13569999999999999,0.31380000000000002,206.4102,163.04490000000001,129.0718,194.893,"N/A","N/A",0.89970000000000006,1.2181999999999999,2.7692000000000001,1632.1560999999999,20.438400000000001,25.362100000000002,null,"N/A",35419309.104000002,144479.83000000002,8075159.4670000002,25102101,7806577,776782.62300000002,47492,0,0,14035.517,0,68755084.917999998,8630851.6229999997,824274.62300000002,44429766.540999994,32956170,45.769697553811241,0.18670037019381791,10.434918575575658,32.43754889068326,10.087849742393415,1.0037775049584767,6.1370324018548465E-2,0,0,1.8137038365574103E-2,0,88.847002428629551,11.152997571370438,1.0651478289770251,57.413231042904762,42.586768957095224,null,5691.5126408494434,9913.2421873212297,8374.6265899750106,10481.377373792575,10874.997623354058,7861.9992903174816,null,1932.0215096135964,null,20.538268846334176]
[81,45,"TX",48,135365.79999999993,3173156987.6342511,1564526492.7392738,429697350.69380009,205447954.42858341,150149.66784925872,70889.696550261913,410195.38254338125,258352875.48202974,7671865.372442509,5623891.8568737125,259305005.51120883,"N/A",0.69886243239258194,0.69009883060095556,1.909229283732234,1202.4876349127437,17.854113738554179,13.088030093258048,1206.9192658159445,"N/A",9.4637402709282836E-2,9.0621279830351315E-2,0.25854086900957435,162.83649153749866,"N/A",0.8375180335747161,0.82701571695365084,2.2880239103429836,1441.0634092065445,21.396402977822934,15.68471950845206,"N/A",1.3984000000000001,4.6569000000000003,0.44590000000000002,0.8387,1.3492999999999999,4.851,0.45279999999999998,0.81079999999999997,4.8544999999999998,82.379599999999996,9.4999999999999998E-3,2.2940999999999998,2234.0778,3134.4766,927.86291426959428,1449.6022,"N/A","N/A",0.13400000000000001,0.30840000000000001,5.7299999999999997E-2,9.4700000000000006E-2,0.1278,0.32419999999999999,5.7200000000000001E-2,9.06E-2,0.46510000000000001,5.4561000000000002,1.1999999999999999E-3,0.25900000000000001,214.06450000000001,207.602,119.18842108112713,163.679,"N/A","N/A",0.81659999999999999,0.9587,1.8520000000000001,1310.6733999999999,22.154599999999999,10.668900000000001,null,"N/A",138192432.80080003,3814854.2320000003,213901281.84800005,38441017,584474.42000000004,1684258.872,31994944,118265,0,673259.85100000014,292562.67,395315408.4018001,34381942.291999996,33797467.871999994,358558650.27380013,71138700.420000002,32.160410711788437,0.88780026822144498,49.779520749343618,8.9460679564191334,0.13602001945236411,0.39196398797445536,7.4459253584738567,2.7522859940617827E-2,0,0.1566823369780935,6.8085751407966785E-2,91.998567774158701,8.0014322258412935,7.8654122063889282,83.444463805714037,16.555536194285974,null,7384.6324221240657,8849.75717420619,8007.5843571869327,10436.470316189745,15098.489417250315,7784.841059669986,null,1448.5194045168951,null,7.455995310350545]
[82,46,"UT",49,8826.6999999999989,370598739.77969396,164276334.69945523,39400420.758000001,17327101.331999995,51961.45341177447,22287.720687637608,23116.608682219718,35475233.394360103,871733.24578657711,1103711.5760755525,35655461.887732573,"N/A",2.6376090616354158,2.572585022801968,1.1734193816966303,1800.7540382500652,22.124973008304163,28.012685013051566,1809.9025950372859,"N/A",0.28041894283107099,0.2713442654830735,0.12475276465301319,191.44821385765479,"N/A",2.7629909915824653,2.6948759565887164,1.2291992881484128,1886.355054700829,23.176710301808733,29.344301802295327,"N/A",3.2376999999999998,19.9236,0.45760000000000001,2.7641,3.181,19.683399999999999,0.49030000000000001,2.6983000000000001,1.4714,1.37,9.1999999999999998E-3,1.2185999999999999,2067.3912,1420.5864999999999,1033.5056999999999,1888.3909000000001,"N/A","N/A",0.32100000000000001,2.0623999999999998,5.2499999999999998E-2,0.28070000000000001,0.31380000000000002,2.0371000000000001,5.4300000000000001E-2,0.27150000000000002,0.1459,0.14180000000000001,1.1000000000000001E-3,0.1237,204.9744,147.04990000000001,118.58710000000001,191.73580000000001,"N/A","N/A",2.0693000000000001,2.3852000000000002,0.62860000000000005,1607.7293,22.7026,19.860700000000001,null,"N/A",30799120.460000001,43717.896999999997,6577064.0309999995,0,747786,59716.277990000002,703911,1619,334638,4460.0920099999994,128388,37552750.480010003,1847670.2779900001,1099884.2779900001,37612466.758000001,1787954,78.169521714425954,0.11095794450652752,16.692877650715364,0,1.8979137420713124,0.15156253877790124,1.7865570632442431,4.1090931742683804E-3,0.84932595531242872,1.1319909595367472E-2,0.32585438817663298,95.310531607419847,4.6894683925801539,2.791554650508842,95.462094146197742,4.5379058538022532,null,9405.9589377467819,9853.0825474473677,8385.1283902119485,10086.094653771397,9660.5744036548131,8715.161261216439,null,1889.1886647008591,null,2.8336100000301485]
[83,47,"VA",51,29874.999999999989,384526861.21894926,195229529.31213146,70739234.746999994,33133544.580000013,24925.473390657047,12319.672591726086,41121.561230482104,28892649.59235866,2438306.3346894034,811218.6035768484,29043990.692427322,"N/A",0.70471425029697887,0.74363746758096372,1.1626238643251945,816.87764069525736,34.468938537574587,11.467732248987209,821.15648540173277,"N/A",0.12964230021093118,0.12620706135114929,0.21388134550666682,150.27636561341399,"N/A",1.1774615021504353,1.2424957906899599,1.9425530860875739,1364.868063162912,57.591922017867553,19.160692769390074,"N/A",2.1917,2.3155000000000001,0.22070000000000001,1.0892999999999999,2.2035,2.6293000000000002,0.26519999999999999,1.1005,3.7696000000000001,0.1583,3.32E-2,1.6720999999999999,1932.482,1726.3503000000001,937.99109999999996,1375.6967,"N/A","N/A",0.21840000000000001,0.21779999999999999,2.7900000000000001E-2,0.1231,0.21190000000000001,0.24149999999999999,3.2399999999999998E-2,0.1205,0.37559999999999999,1.49E-2,4.1999999999999997E-3,0.189,192.5256,162.35380000000001,118.5954,155.4812,"N/A","N/A",1.6641999999999999,2.0303,3.5173999999999999,1705.7182,71.427700000000002,27.445,null,"N/A",14180795.223999999,363967.53800000006,25037748.952,28723390,-321800,2372689.10531,0,0,0,382443.92768999998,0,68688345.641690001,2050889.1053100005,2372689.10531,42337644.746999994,28401590,20.04657708656001,0.51452003870516239,35.394430038079868,40.604609454328511,-0.45491020810576033,3.3541345390517163,0,0,0,0.54063905138049184,0,97.100775669054045,2.8992243309459571,3.3541345390517163,59.850300753777248,40.149699246222752,null,5435.83575075721,9082.3866919568409,10970.575220669765,10037.532670979859,10633.260816808723,7909.16932697221,null,1412.1403817294799,null,47.272318566567947]
[84,48,"VT",50,1276,5301223.5480805999,2165657.7414906332,6568121.0020000003,2528872.3473333335,196.70632423653342,101.10679821986679,60.09639697076453,13780.128001014755,341084.30980666418,45541.992785741895,24420.522135774721,"N/A",5.9897290009315034E-2,7.9961962751091589E-2,1.8299418342769602E-2,4.1960639874992225,51.930271945782302,6.9337932068965085,7.4360755924985682,"N/A",7.4211669231626476E-2,9.3372831988007915E-2,2.2672651483457429E-2,5.1988481059260705,"N/A",1.0953504682580364,1.4622760617152912,0.33464412909975,76.73403342343498,949.65644829229745,126.79928649188209,"N/A","N/A",5.2580999999999998,"N/A",5.2580999999999998,"N/A",6.2922000000000002,"N/A",6.2922000000000002,"N/A",2.7069999999999999,"N/A",2.7069999999999999,"N/A",3019.1439999999998,"N/A",3019.1439999999998,"N/A","N/A","N/A",0.28289999999999998,"N/A",0.28289999999999998,"N/A",0.27589999999999998,"N/A",0.27589999999999998,"N/A",0.14560000000000001,"N/A",0.14560000000000001,"N/A",162.4152,"N/A",162.4152,"N/A","N/A",1.4023000000000001,1.6357999999999999,0.49840000000000001,130.90799999999999,1067.5929000000001,142.67080000000001,null,"N/A",0,3419.76,2538.7620000000002,4989338,1109205,353207.48,106897,3515,0,0,0,4995296.5219999999,1572824.48,463619.48,359166.00199999998,6208955,0,5.206603226339282E-2,3.8652789728248677E-2,75.962942803287888,16.887706539849766,5.3776031210820863,1.6275126473377963,5.3516066450811098E-2,0,0,0,76.053661625279531,23.946338374720458,7.0586318348706936,5.4683219430737271,94.531678056926268,null,807.11417260223607,14759.814455045775,806.00830464143746,"-",18589.048315674889,"-",null,2397.2182166791504,null,2320.4841832557154]
[85,49,"WA",53,32149.099999999991,102619941.30801469,37552063.483347811,116834423.661,52860648.958333306,6848.5262831475184,2434.2217688093906,6357.5818884234868,7342211.5033935923,892265.50950921618,280845.70772968605,7394968.0797436563,"N/A",0.11723473388320563,9.2099579433015791E-2,0.10883062866591918,125.68575721650886,7.637008696154159,2.4037924691148538,126.5888570854848,"N/A",0.13347359579151591,0.12964516689682465,0.12390538929156364,143.09521930744197,"N/A",1.202202537986732,0.94445003178144016,1.1160212819112523,1288.8649234705763,78.314940743500287,24.650078619551955,"N/A",2.4891999999999999,26.1738,0.32,1.1718,2.5110999999999999,26.144200000000001,0.33329999999999999,1.1224000000000001,0.65739999999999998,0.65939999999999999,1.09E-2,0.2646,2431.8755999999998,1750.4148,854.99467143778986,1481.4292,"N/A","N/A",0.21260000000000001,2.4380000000000002,4.4400000000000002E-2,0.1305,0.21079999999999999,2.4380000000000002,4.6199999999999998E-2,0.12590000000000001,5.62E-2,6.1400000000000003E-2,1.5E-3,2.9499999999999998E-2,207.72380000000001,163.04490000000001,118.52891300373193,165.03489999999999,"N/A","N/A",1.2576000000000001,1.0601,0.7389,1463.0838000000001,53.390599999999999,23.102799999999998,null,"N/A",3762956.9040000001,432049.348,5437592.4979999987,9333709,89507906,1616173.9569999999,6598716,794,0,66360.953999999998,78165,19110833.704,97723589.957000017,8215683.9569999995,11393298.661,105441125,3.2207604454988181,0.36979627618449967,4.6541013578133459,7.9888347179955712,76.610902159889932,1.3833028882732341,5.6479210434986626,6.7959422841321526E-4,0,5.6799145252386489E-2,6.6902371365137242E-2,16.357194314109762,83.642805685890252,7.0319035260003098,9.751662484387424,90.248337515612576,null,878.33652182657033,9007.0439090032251,8865.2994003086624,{"$f":"1000*AX91/BP91","v":11707.255499851242},10735.783823965054,{"$f":"1000*AZ91/BR91","v":7213.3849013773552},null,1486.4765908179563,null,197.61166734738003]
[86,50,"WI",55,21870.499999999985,469822851.78439695,225613046.33846384,63742909.901000001,29459027.246666662,27372.34201942521,12922.982933829544,71901.898420732061,43242292.888271086,1807488.0127228061,1401191.085148803,43478456.130602747,"N/A",0.8588356591168359,0.87735299781779463,2.2559967385362203,1356.7718497769019,28.355906806420368,21.981912769985122,1364.1817167785323,"N/A",0.11652196956986868,0.11455882665971838,0.30608089047881415,184.07913844137619,"N/A",1.1807711196525768,1.2062297024661979,3.1016595161328633,1865.3592211361931,38.985148640674026,30.221856158384789,"N/A",1.4618,1.6020000000000001,0.24540000000000001,1.1544000000000001,1.4699,1.5002,0.31590000000000001,1.1426000000000001,4.1886999999999999,3.0831,1.0999999999999999E-2,3.1301000000000001,2280.6967,1682.182,892.40629999999999,1928.4872,"N/A","N/A",0.1336,0.15129999999999999,3.27E-2,0.11459999999999999,0.1336,0.1469,4.0300000000000002E-2,0.11310000000000001,0.38279999999999997,0.29120000000000001,1.5E-3,0.31080000000000002,208.45670000000001,158.90790000000001,118.8306,191.45920000000001,"N/A","N/A",1.1265000000000001,1.2097,2.327,1797.7777000000001,41.654800000000002,28.1967,null,"N/A",32758435.114999998,317567.66800000001,11542006.737,14299595,1522235.01,1668526.8389159997,1557578,0,0,44716.532083999999,32249,58994570.052084006,4748339.8489160007,3226104.838916,46363501.890999995,17379408.009999998,51.391496192874754,0.49820077008285119,18.107122431225765,22.433232217055824,2.3880852197745668,2.6175881231456364,2.4435313706561184,0,0,7.0151381782616873E-2,5.0592293401864413E-2,92.550795286423693,7.4492047135763233,5.0611194938017556,72.735151192513484,27.264848807486509,null,7370.5899607357951,10133.463449092878,9389.8736649897219,{"$f":"1000*AX92/BP92","v":10940.86541713459},10585.892834780398,{"$f":"1000*AZ92/BR92","v":7509.9031730884126},null,1940.1448051925631,null,74.785584056369999]
[87,51,"WV",54,18416.300000000003,697859770.02758956,314612828.63835484,73413404.203999981,32096495.782000009,50578.409881240746,23312.060033210008,88849.226542478675,72352646.562289655,1622530.6225530589,2427499.4029280827,72745945.541280329,"N/A",1.377906676025928,1.4526233761807488,2.4205178197590698,1971.1017993726948,22.101285727663537,33.066160454602908,1981.8164361139031,"N/A",0.14495293196007317,0.1481952286186464,0.25463346752017546,207.35583184406585,"N/A",1.4308716946204221,1.5084604117861724,2.5135595137739348,2046.8685006100516,22.950831658382217,34.337182530189118,"N/A",1.4328000000000001,"N/A",0.68330000000000002,1.4311,1.4922,"N/A",0.65010000000000001,1.4890000000000001,2.5198,"N/A",1.1599999999999999E-2,2.5139,2048.7291,"N/A",1385.7474999999999,2047.1737000000001,"N/A","N/A",0.1452,"N/A",5.8400000000000001E-2,0.14499999999999999,0.14860000000000001,"N/A",5.5399999999999998E-2,0.1482,0.25540000000000002,"N/A",1E-3,0.25469999999999998,207.63910000000001,"N/A",118.40779999999999,207.39089999999999,"N/A","N/A",1.3557999999999999,1.5403,3.3534999999999999,1756.3686,19.7075,29.359200000000001,null,"N/A",70267428.066,143448.36000000002,242894.21400000004,0,1431440,10538.951999999999,1286024,0,0,31630.612000000001,0,70685401.251999989,2728002.952,1296562.952,70695940.203999981,2717464,95.714711540609144,0.19539804965505758,0.33085812684159083,0,1.9498346596519862,1.4355623627961087E-2,1.7517563910078564,0,0,4.3085608606441089E-2,0,96.284053325712208,3.7159466742878036,1.7661120146358176,96.298408949340157,3.7015910506598426,null,9505.8903424283126,9871.2849424429151,8468.8797820926575,{"$f":"1000*AX93/BP93","v":9866.7789448133808},"-",{"$f":"1000*AZ93/BR93","v":11703.177493374593},null,2047.2146683696842,null,0.34616775963263535]
[88,52,"WY",56,9925.5000000000018,500047260.55992544,202355313.28452587,49588606.105000004,19819330.526999995,49592.637364917005,19613.449389177975,50386.321894328335,52023827.456685439,1159613.8768664557,1719605.7266328363,52302542.290020615,"N/A",2.0001625881521439,1.979224208654117,2.0321733499683066,2098.2169713151061,23.384683860866421,34.677436243957033,2109.4580549118104,"N/A",0.19835180102531069,0.19385158779201492,0.20152623909151507,208.07564228401938,"N/A",2.2376305013671041,2.2142062273148282,2.273441718633205,2347.3263230257239,26.161014200472348,38.794490762062502,"N/A",2.2515000000000001,3.1678000000000002,1.5371999999999999,2.2404999999999999,2.1876000000000002,3.6110000000000002,1.5503,2.1791999999999998,2.3134000000000001,0.13619999999999999,5.45E-2,2.2774000000000001,2377.8258000000001,941.71360000000004,679.20519999999999,2350.7910999999999,"N/A","N/A",0.19839999999999999,0.499,0.26469999999999999,0.19900000000000001,0.19389999999999999,0.56159999999999999,0.25619999999999998,0.19439999999999999,0.2039,2.1499999999999998E-2,9.4000000000000004E-3,0.20230000000000001,209.53380000000001,148.35339999999999,116.9571,208.77539999999999,"N/A","N/A",2.3331,2.0994000000000002,2.4603000000000002,2351.6010000000001,26.2836,38.707799999999999,null,"N/A",43411765.980000004,62641.637000000002,512914.82599999988,0,893470,0,4369107,0,0,271710.90999999997,66995.751999999993,44326029.105000004,5262577,4369107,44326029.105000004,5262577,87.543831919935343,0.12632264126836157,1.0343400758511798,0,1.8017646999557659,0,8.8107074249047397,0,0,0.5479301221427223,0.13510311594187929,89.387527875139483,10.612472124860505,8.8107074249047397,89.387527875139483,10.612472124860505,null,10083.914427865029,11281.120160242817,11263.783951557512,{"$f":"1000*AX94/BP94","v":11348.172943935537},{"$f":"1000*AY94/BQ94","v":6347.7722788962037},{"$f":"1000*AZ94/BR94","v":5807.3019936369828},null,2355.2203739027582,null,7.8940508770342603]

{"sheet":"Profiles","index":12,"n_rows":26,"n_cols":12,"rows_kept":26,"cut":false,"hidden":true,"merged":[]}
["Displaced Electricity",{"$f":"deinput","v":2},{"$f":"LOOKUP(deinput,Lists!A25:A40,Lists!B25:B40)","v":"eGRID Fossil Fuel (2012 data)"}]
[null,{"$f":"IF(deinput<6,LOOKUP(deinput2,listb6a,listb6),\"N/A\")","v":"US Average"},"State/NERC Region"]
[]
[null,"NOx",{"$f":"LOOKUP(B1,B11:B26,H11:H26)","v":1.3268},"lb/MWh Average",null,"CH4",{"$f":"LOOKUP(B1,B11:B26,K11:K26)","v":3.3887508382591906E-2},"lb/MWh Average"]
[null,"SO2",{"$f":"LOOKUP(B1,B11:B26,I11:I26)","v":2.5741000000000001},"lb/MWh Average",null,"N2O",{"$f":"LOOKUP(B1,B11:B26,L11:L26)","v":2.2624581495462905E-2},"lb/MWh Average"]
[null,"CO2",{"$f":"LOOKUP(B1,B11:B26,J11:J26)","v":1640.1344999999999},"lb/MWh Average"]
[null,"Heat Rate",{"$f":"LOOKUP(B1,B11:B26,C11:C26)","v":9447.7084265316407},"Btu/kWh Average"]
[]
["Generation Sources"]
["Name","Code","Btu/kWh","NOx lb/MMBtu","SO2 lb/MMBtu","CO2 lb/MMBtu",null,"NOx lb/MWh","SO2 lb/MWh","CO2 lb/MWh","CH4 lb/MWh","N2O lb/MWh"]
["EGrid Annual Average",1,{"$f":"LOOKUP(deinput2,EGRID!$A$7:$A$94,EGRID!$DK$7:$DK$94)","v":6629.5773155103261},{"$f":"LOOKUP(deinput2,EGRID!$A$7:$A$94,EGRID!$Z$7:$Z$94)","v":0.14270556246199553},{"$f":"LOOKUP(deinput2,EGRID!$A$7:$A$94,EGRID!$AB$7:$AB$94)","v":0.2846690379485855},{"$f":"LOOKUP(deinput2,EGRID!$A$7:$A$94,EGRID!$AC$7:$AC$94)","v":171.43312138127078},null,{"$f":"LOOKUP(deinput2,EGRID!$A$7:$A$94,EGRID!$R$7:$R$94)","v":0.94607755969518759},{"$f":"LOOKUP(deinput2,EGRID!$A$7:$A$94,EGRID!$T$7:$T$94)","v":1.8872353964120905},{"$f":"LOOKUP(deinput2,EGRID!$A$7:$A$94,EGRID!$U$7:$U$94)","v":1136.5291326364011},{"$f":"LOOKUP(deinput2,EGRID!$A$7:$A$94,EGRID!$V$7:$V$94)/1000","v":2.3779296175302521E-2},{"$f":"LOOKUP(deinput2,EGRID!$A$7:$A$94,EGRID!$W$7:$W$94)/1000","v":1.5875956949943579E-2}]
["EGrid Annual Fossil",2,{"$f":"LOOKUP(deinput2,EGRID!$A$7:$A$94,EGRID!$DL$7:$DL$94)","v":9447.7084265316407},{"$f":"LOOKUP(deinput2,EGRID!$A$7:$A$94,EGRID!$BG$7:$BG$94)","v":0.14130000000000001},{"$f":"LOOKUP(deinput2,EGRID!$A$7:$A$94,EGRID!$BO$7:$BO$94)","v":0.27410000000000001},{"$f":"LOOKUP(deinput2,EGRID!$A$7:$A$94,EGRID!$BS$7:$BS$94)","v":174.66069999999999},null,{"$f":"LOOKUP(deinput2,EGRID!$A$7:$A$94,EGRID!$AO$7:$AO$94)","v":1.3268},{"$f":"LOOKUP(deinput2,EGRID!$A$7:$A$94,EGRID!$AW$7:$AW$94)","v":2.5741000000000001},{"$f":"LOOKUP(deinput2,EGRID!$A$7:$A$94,EGRID!$BA$7:$BA$94)","v":1640.1344999999999},{"$f":"LOOKUP(deinput2,EGRID!$A$7:$A$94,EGRID!$AI$7:$AI$94)/1000","v":3.3887508382591906E-2},{"$f":"LOOKUP(deinput2,EGRID!$A$7:$A$94,EGRID!$AJ$7:$AJ$94)/1000","v":2.2624581495462905E-2}]
["EGrid Annual Non-Baseload",3,{"$f":"LOOKUP(deinput2,EGRID!$A$7:$A$94,EGRID!$DM$7:$DM$94)","v":8870.6612306031057},null,null,null,null,{"$f":"LOOKUP(deinput2,EGRID!$A$7:$A$94,EGRID!$BV$7:$BV$94)","v":1.3554999999999999},{"$f":"LOOKUP(deinput2,EGRID!$A$7:$A$94,EGRID!$BX$7:$BX$94)","v":2.9317000000000002},{"$f":"LOOKUP(deinput2,EGRID!$A$7:$A$94,EGRID!$BY$7:$BY$94)","v":1549.3559},{"$f":"LOOKUP(deinput2,EGRID!$A$7:$A$94,EGRID!$BZ$7:$BZ$94)/1000","v":3.0994000000000001E-2},{"$f":"LOOKUP(deinput2,EGRID!$A$7:$A$94,EGRID!$CA$7:$CA$94)/1000","v":1.9864699999999999E-2}]
["EGrid Annual Coal",4,{"$f":"LOOKUP(deinput2,EGRID!$A$7:$A$94,EGRID!$DN$7:$DN$94)","v":10486.160808514376},{"$f":"LOOKUP(deinput2,EGRID!$A$7:$A$94,EGRID!$BD$7:$BD$94)","v":0.1925},{"$f":"LOOKUP(deinput2,EGRID!$A$7:$A$94,EGRID!$BL$7:$BL$94)","v":0.41860000000000003},{"$f":"LOOKUP(deinput2,EGRID!$A$7:$A$94,EGRID!$BP$7:$BP$94)","v":207.31939632518819},null,{"$f":"LOOKUP(deinput2,EGRID!$A$7:$A$94,EGRID!$AL$7:$AL$94)","v":2.0270000000000001},{"$f":"LOOKUP(deinput2,EGRID!$A$7:$A$94,EGRID!$AT$7:$AT$94)","v":4.4062999999999999},{"$f":"LOOKUP(deinput2,EGRID!$A$7:$A$94,EGRID!$AX$7:$AX$94)","v":2173.9845285900478},{"$f":"ch4coal*C14/1000","v":0.25422648264162256},{"$f":"n2ocoal*C14/1000","v":3.69783974751451E-2}]
["EGrid Annual Oil",5,{"$f":"LOOKUP(deinput2,EGRID!$A$7:$A$94,EGRID!$DO$7:$DO$94)","v":10754.153967973516},{"$f":"LOOKUP(deinput2,EGRID!$A$7:$A$94,EGRID!$BE$7:$BE$94)","v":0.32750000000000001},{"$f":"LOOKUP(deinput2,EGRID!$A$7:$A$94,EGRID!$BM$7:$BM$94)","v":1.294},{"$f":"LOOKUP(deinput2,EGRID!$A$7:$A$94,EGRID!$BQ$7:$BQ$94)","v":177.07578910169178},null,{"$f":"LOOKUP(deinput2,EGRID!$A$7:$A$94,EGRID!$AM$7:$AM$94)","v":3.3875000000000002},{"$f":"LOOKUP(deinput2,EGRID!$A$7:$A$94,EGRID!$AU$7:$AU$94)","v":13.383599999999999},{"$f":"LOOKUP(deinput2,EGRID!$A$7:$A$94,EGRID!$AY$7:$AY$94)","v":1904.3003000000001},{"$f":"ch4oil*C15/1000","v":7.1106466036240892E-2},{"$f":"n2ooil*C15/1000","v":1.4221293207248178E-2}]
["EGrid Annual Natural Gas",6,{"$f":"LOOKUP(deinput2,EGRID!$A$7:$A$94,EGRID!$DP$7:$DP$94)","v":7876.1718228561549},{"$f":"LOOKUP(deinput2,EGRID!$A$7:$A$94,EGRID!$BF$7:$BF$94)","v":5.0099999999999999E-2},{"$f":"LOOKUP(deinput2,EGRID!$A$7:$A$94,EGRID!$BN$7:$BN$94)","v":1.06E-2},{"$f":"LOOKUP(deinput2,EGRID!$A$7:$A$94,EGRID!$BR$7:$BR$94)","v":119.43912316493781},null,{"$f":"LOOKUP(deinput2,EGRID!$A$7:$A$94,EGRID!$AN$7:$AN$94)","v":0.39729999999999999},{"$f":"LOOKUP(deinput2,EGRID!$A$7:$A$94,EGRID!$AV$7:$AV$94)","v":8.4400000000000003E-2},{"$f":"LOOKUP(deinput2,EGRID!$A$7:$A$94,EGRID!$AZ$7:$AZ$94)","v":940.72305641832907},{"$f":"ch4gas*C16/1000","v":1.7359082697574964E-2},{"$f":"n2ogas*C16/1000","v":1.7359082697574965E-3}]
["Coal Boiler 3.8 lb/MWh NOx",7,9500,{"$f":"H17*1000/C17","v":0.4},{"$f":"I17*1000/C17","v":0.52631578947368418},{"$f":"J17*1000/C17","v":207.1},null,3.8,5,{"$f":"co2coal*C17/1000","v":1967.45},{"$f":"ch4coal*C17/1000","v":0.23031800000000002},{"$f":"n2ocoal*C17/1000","v":3.3500800000000004E-2}]
["Coal Boiler 1.5 lb/MWh NOx",8,9500,0.15789473684210525,0.26315789473684209,207.1,null,1.5,2.5,{"$f":"co2coal*C18/1000","v":1967.45},{"$f":"ch4coal*C18/1000","v":0.23031800000000002},{"$f":"n2ocoal*C18/1000","v":3.3500800000000004E-2}]
["Coal Boiler with SCR 0.8 lb/MWh NOx",9,9500,8.4210526315789472E-2,0.10526315789473684,207.1,null,0.8,1,{"$f":"co2coal*C19/1000","v":1967.45},{"$f":"ch4coal*C19/1000","v":0.23031800000000002},{"$f":"n2ocoal*C19/1000","v":3.3500800000000004E-2}]
["Gas Boiler 0.77 lb/MWh NOx",10,11000,7.0000000000000007E-2,5.669902912621359E-4,116.9,null,0.77,{"$f":"0.000584*C20/1030","v":6.2368932038834946E-3},{"$f":"co2gas*C20/1000","v":1285.9000000000001},{"$f":"ch4gas*C20/1000","v":2.4244000000000002E-2},{"$f":"n2ogas*C20/1000","v":2.4244000000000002E-3}]
["Gas Turbine Peaker 25 ppm",11,12000,9.1911764705882359E-2,5.669902912621359E-4,116.9,null,{"$f":"25*C21/(ppmbtu*1000)","v":1.1029411764705883},{"$f":"0.000584*C21/1030","v":6.8038834951456312E-3},{"$f":"co2gas*C21/1000","v":1402.8},{"$f":"ch4gas*C21/1000","v":2.6448000000000003E-2},{"$f":"n2ogas*C21/1000","v":2.6448000000000001E-3}]
["Gas combined-cycle 9 ppm",12,8000,3.3088235294117647E-2,5.669902912621359E-4,116.9,null,{"$f":"9*C22/(ppmbtu*1000)","v":0.26470588235294118},{"$f":"0.000584*C22/1030","v":4.5359223300970872E-3},{"$f":"co2gas*C22/1000","v":935.2},{"$f":"ch4gas*C22/1000","v":1.7632000000000002E-2},{"$f":"n2ogas*C22/1000","v":1.7632000000000001E-3}]
["Gas combined-cycle 3 ppm",13,7000,1.1029411764705881E-2,5.669902912621359E-4,116.9,null,{"$f":"3*C23/(ppmbtu*1000)","v":7.720588235294118E-2},{"$f":"0.000584*C23/1030","v":3.9689320388349514E-3},{"$f":"co2gas*C23/1000","v":818.3},{"$f":"ch4gas*C23/1000","v":1.5428000000000001E-2},{"$f":"n2ogas*C23/1000","v":1.5428000000000002E-3}]
["User Source 1",14,{"$f":"SubGenSources!F23","v":0},null,null,null,null,{"$f":"gennox1","v":0},{"$f":"genso21","v":0},{"$f":"genco21","v":0}]
["User Source 2",15,{"$f":"SubGenSources!F24","v":0},null,null,null,null,{"$f":"gennox2","v":0},{"$f":"genso22","v":0},{"$f":"genco22","v":0}]
["User Source 3",16,{"$f":"SubGenSources!F25","v":0},null,null,null,null,{"$f":"gennox3","v":0},{"$f":"genso23","v":0},{"$f":"genco23","v":0}]

{"sheet":"Factors","index":13,"n_rows":121,"n_cols":8,"rows_kept":121,"cut":false,"hidden":true,"merged":[]}
["Factors"]
[]
["General Emission Factors"]
[3.11,null,"gm/hp-hr to lb/MWh for recip engines"]
[{"$f":"12/44","v":0.27272727272727271},null,"ratio of carbon to CO2"]
[{"$f":"2000/2206","v":0.90661831368993651},null,"ratio of tonnes to tons",null,null,null,null,7.27]
[6.7720000000000002,null,"metric tons of Carbon per home",null,null,null,null,{"$f":"H6*CO2tocarbon","v":1.9827272727272724}]
[1.29,null,"metric tons of Carbon per car"]
[12000,null,"Btu per ton of cooling capacity"]
[10812,null,"kWh per average U.S. home per year"]
[3.4121400000000001E-3,null,"MMBtu/kWh"]
[675,null,"gal/vehicle"]
[0.120405,null,"MMBtu/gal (gasoline)"]
[]
["Oil"]
[138000,null,"Btu/gallon distillate oil"]
[304,null,"lb/bbl distillate oil"]
[{"$f":"A17/42","v":7.2380952380952381},"lb/gal","distillate oil"]
[150000,null,"Btu/gallon residual oil"]
[331,null,"lb/bbl residual oil"]
[163.1,null,"lb/MMBtu CO2 emission factor"]
[235,null,"ppm per lb/MMBtu LHV for diesel @15%O2"]
[258,null,"ppm per lb/MMBtu HHV for diesel @15%O2"]
[780,null,"ppm per lb/MMBtu HHV for diesel @3%O2"]
[{"$f":"sulfurppmlow/10000","v":5.0000000000000001E-4},"%","Lower limit of sulfur content"]
[0.05,"%","Upper limit of sulfur content"]
[5,"ppm","Lower limit of sulfur content"]
[5000,"ppm","Upper limit of sulfur content"]
[20000,"Btu/lb","Heat content of oil (distillate"]
[6.6120000000000007E-3,null,"lb/MMBtu CH4 emission factor"]
[1.3224000000000001E-3,null,"lb/MMBtu N20 emission factor"]
[]
["Natural Gas"]
[0.42380000000000001,null,"lb/cf heat content of natural gas"]
[1028,null,"Btu/cf of natural gas"]
[7.0967437470559683E-7,null,"sulfur content of natural gas"]
[116.9,null,"lb/MMBtu CO2 emission factor"]
[{"$f":"ppmbtu*0.91","v":247.52},null,"ppm per lb/MMBtu LHV for natural gas @15%O2"]
[272,null,"ppm per lb/MMBtu HHV for natural gas @15%O2"]
[823,null,"ppm per lb/MMBtu HHV for natural gas @3%O2"]
[2.2040000000000002E-3,null,"lb/MMBtu CH4 emission factor"]
[2.2040000000000002E-4,null,"lb/MMBtu N20 emission factor"]
[]
["Propane"]
[91600,null,"Btu/gallon"]
[139,null,"lb/MMBtu CO2 emission factor"]
[7.0967437470559683E-7,null,"sulfur content of natural gas"]
[582,null,"kg/m3"]
[4.2,null,"lb/gal"]
[2.2040000000000002E-3,null,"lb/MMBtu CH4 emission factor"]
[2.2040000000000002E-4,null,"lb/MMBtu N20 emission factor"]
[]
[]
["Coal"]
[21.015000000000001,null,"MMBtu/ton"]
[207.1,null,"lb/MMBtu CO2 emission factor"]
[11175,"Btu/lb"]
[2.4244000000000002E-2,null,"lb/MMBtu CH4 emission factor"]
[3.5264000000000003E-3,null,"lb/MMBtu N20 emission factor"]
[]
["Woody Biomass"]
[206.7,null,"lb/MMBtu CO2 emission factor"]
[7500,null,"Btu/lb"]
[7.0000000000000007E-2,null,"lb/MMBtu CH4 emission factor"]
[8.9999999999999993E-3,null,"lb/MMBtu N20 emission factor"]
[]
[]
["CHP Technologies"]
[1,null,"Accept kW capacity values that are THIS percent of the lowest sample"]
[1,null,"Accept kW capacity values that are THIS percent of the highest sample"]
[7.0000000000000007E-2,"%","Minimum efficiency of CHP"]
[0.66,"%","Maximum efficiency of CHP"]
[{"$f":"3412/effpercenthigh","v":5169.6969696969691},"Btu/kWh HHV","Minimum HHV of CHP"]
[{"$f":"3412/effpercentlow","v":48742.857142857138},"Btu/kWh HHV","Maximum HHV of CHP"]
[{"$f":"A73*0.91","v":4704.424242424242},"Btu/kWh LHV","Minimum LHV of CHP"]
[{"$f":"A74*0.91","v":44356},"Btu/kWh LHV","Maximum LHV of CHP"]
[0.05,null,"Minimum Power to Heat ratio for CHP"]
[10,null,"Maximum Power to Heat ratio for CHP"]
[1,"ppm","Minimum NOx rate for CHP"]
[200,"ppm","Maximum NOx rate for CHP"]
[0.05,"gm/hphr","Minimum NOx rate for CHP"]
[20,"gm/hphr","Maximum NOx rate for CHP"]
[5.0000000000000001E-3,"lb/MMBtu","Minimum NOx rate for CHP"]
[0.8,"lb/MMBtu","Maximum NOx rate for CHP"]
[0.05,"lb/MMBtu","Minimum NOx rate for CHP"]
[8,"lb/MMBtu","Maximum NOx rate for CHP"]
[]
["Thermal Production"]
[0.66,null,"Minimum efficiecy of thermal production technology"]
[0.99,null,"Maximum efficiecy of thermal production technology"]
[3.5,null,"Maximum efficiecy of electric technology"]
[]
[]
[1100,null,"btu/lb steam"]
[]
[]
[]
["Active Cell Highlighting"]
[null,"Cell to Highlight"]
[]
["Global Warming Potential"]
["CO2",1]
["CH4",21]
["N2O",310]
[]
[]
["Fuel and Technology Match"]
[1]
[]
["tech"]
[{"$f":"chptechinput","v":0},{"$f":"VLOOKUP(A111,A112:B121,2)","v":{"$error":"#N/A"}},{"$f":"VLOOKUP(A111,A112:C121,3)","v":{"$error":"#N/A"}}]
[1,1,7]
[2,1,7]
[3,1,7]
[4,1,7]
[5,1,7]
[6,1,7]
[7,1,7]
[8,1,7]
[9,8,8]
[10,8,8]

{"sheet":"Calc1","index":14,"n_rows":192,"n_cols":6,"rows_kept":192,"cut":false,"hidden":true,"merged":[]}
["Calculations"]
[]
["Total Emissions","CHP","Displaced Generation - Total","Displaced Thermal Supply - Total"]
["Number of CHP Units:",{"$f":"chpnumunits","v":1}]
["Generating Capacity (kW)",{"$f":"B28*chpnumunits","v":0}]
["CHP Generation (MWh/year)",{"$f":"IF(B155>0,dispgridelec,B29*chpnumunits)","v":0}]
["CHP fuel consumption (MMBtu/year)",{"$f":"B30*chpnumunits","v":0},{"$f":"C30*chpnumunits","v":0},{"$f":"D30*chpnumunits","v":0}]
["Duct Burner fuel (MMBtu/year)",{"$f":"B31*chpnumunits","v":0}]
[]
[]
["CHP with Duct Burners"]
["NOx (tons/year)",{"$f":"B17+B22","v":0},{"$f":"C17","v":0},0]
["SO2 (tons/year)",{"$f":"B18+B23","v":{"$error":"#DIV/0!"}},0,0]
["CO2 (tons/year)",{"$f":"B19+B24","v":{"$error":"#DIV/0!"}},0,0]
[]
["CHP Unit"]
["NOx (tons/year)",{"$f":"B40*chpnumunits","v":0},0,{"$f":"D40","v":0},"CH4 (tons/year)",{"$f":"F40*chpnumunits","v":{"$error":"#N/A"}}]
["SO2 (tons/year)",0,0,{"$f":"D41","v":0},"N2O (tons/year)",{"$f":"F41*chpnumunits","v":{"$error":"#N/A"}}]
["CO2 (tons/year)",0,0,{"$f":"D42","v":0}]
[]
["Duct Burners"]
["NOx (tons/year)",{"$f":"B45*chpnumunits","v":0},null,null,"CH4 (tons/year)",{"$f":"E112*chpnumunits","v":0}]
["SO2 (tons/year)",{"$f":"B46*chpnumunits","v":{"$error":"#DIV/0!"}},null,null,"N2O (tons/year)",{"$f":"E113*chpnumunits","v":0}]
["CO2 (tons/year)",{"$f":"B47*chpnumunits","v":{"$error":"#DIV/0!"}}]
[]
[null,"CHP","Displaced Generation per CHP unit","Displaced Thermal Supply per CHP unit"]
["Unit Emissions for CHP System"]
["Generating Capacity (kW)",{"$f":"ccap","v":0}]
["CHP Generation (MWh/year)",{"$f":"cMWh","v":0}]
["CHP fuel consumption (MMBtu/year)",{"$f":"cbtu","v":0},{"$f":"B159","v":0},{"$f":"dsbtu","v":0}]
["Duct Burner fuel (MMBtu/year)",{"$f":"B107","v":0}]
[]
[]
["CHP with Duct Burners"]
["NOx (tons/year)",{"$f":"B40+B45","v":0},{"$f":"denoxtons","v":0},{"$f":"dsnoxtons","v":0},"CH4 (tons/year)",{"$f":"F40+F45","v":{"$error":"#N/A"}}]
["SO2 (tons/year)",{"$f":"B41+B46","v":{"$error":"#DIV/0!"}},{"$f":"deso2tons","v":0},{"$f":"dsso2tons","v":0},"N2O (tons/year)",{"$f":"F41+F46","v":{"$error":"#N/A"}}]
["CO2 (tons/year)",{"$f":"B42+B47","v":{"$error":"#DIV/0!"}},{"$f":"deco2tons","v":0},{"$f":"dsco2tons","v":0}]
[]
["CHP Unit"]
["NOx (tons/year)",{"$f":"cnoxtons","v":0},{"$f":"denoxtons","v":0},{"$f":"dsnoxtons","v":0},"CH4 (tons/year)",{"$f":"E87","v":{"$error":"#N/A"}}]
["SO2 (tons/year)",{"$f":"cso2tons","v":0},{"$f":"deso2tons","v":0},{"$f":"dsso2tons","v":0},"N2O (tons/year)",{"$f":"E88","v":{"$error":"#N/A"}}]
["CO2 (tons/year)",{"$f":"cco2tons","v":0},{"$f":"deco2tons","v":0},{"$f":"dsco2tons","v":0}]
[]
["Duct Burners"]
["NOx (tons/year)",{"$f":"B112","v":0},null,null,"CH4 (tons/year)",{"$f":"E112","v":0}]
["SO2 (tons/year)",{"$f":"B113","v":{"$error":"#DIV/0!"}},null,null,"N2O (tons/year)",{"$f":"E113","v":0}]
["CO2 (tons/year)",{"$f":"B114","v":{"$error":"#DIV/0!"}}]
[]
["CHP Technology",{"$f":"chptechinput","v":0},{"$f":"LOOKUP(chptechinput,lista1a,ListA1)","v":{"$error":"#N/A"}}]
["Capacity",{"$f":"chpcapinput","v":0},"kW"]
["Hours",{"$f":"IFERROR(IF(inputophours>0,inputophours,IF(dispgridelec>0,dispgridelec/(ccap/1000),8760*inputoppercent)),\"-\")","v":0},"hours"]
["Percent of hours",{"$f":"IFERROR(IF(chours>0,chours/8760,inputoppercent),\"-\")","v":0}]
["Calc Hours"]
["CHP Fuel Input (rounded)",{"$f":"ROUND(ccap*chr/1000000,1)","v":0},"MMBtu/hr"]
[]
["CHP Fuel",{"$f":"chpfuelinput","v":0},{"$f":"LOOKUP(chpfuelinput,lista6a,lista6)","v":{"$error":"#N/A"}}]
["CHP operating profile",{"$f":"LOOKUP(chphoursinput,listb3a,listb3)","v":{"$error":"#N/A"}}]
["Max CHP Gen",{"$f":"ccap*8760/1000","v":0},"MWh/yr"]
["CHP Gen",{"$f":"IF(B155>0,B155,ccap*chours/1000)","v":0},"MWh/yr"]
[null,{"$f":"cMWh*1000*3412/1000000","v":0},"MMBtu/yr elec gen equiv"]
["CHP eff input %",{"$f":"chpeffinput1","v":0}]
["CHP eff input Btu/kWh HHV",{"$f":"chpeffinput2","v":0}]
["CHP eff input Btu/kWh LHV",{"$f":"chpeffinput3","v":0}]
["CHP Fuel HHV-LHV",{"$f":"IF(chpfuelinput=1,ppmbtulhv/ppmbtu,ppmbtudlhv/ppmbtud)","v":0.91085271317829453}]
["CHP HHV",{"$f":"IF(chptechinput=6,cbtu/cMWh*1000,IF(B61>0,3413/B61,IF(B62>0,B62,IF(B63>0,B63/B64))))","v":false},"Btu/kWh"]
["CHP percent",{"$f":"IF(chptechinput=6,0,3412/B65)","v":{"$error":"#DIV/0!"}}]
[]
["CHP Fuel input Btu",{"$f":"IF(chptechinput=6,B100,(cMWh*B65/1000))","v":0},"MMBtu/year"]
[]
["CHP NOx input ppm",{"$f":"chpnoxinput1","v":0},"ppm"]
["CHP NOx input gm/hp-hr",{"$f":"chpnoxinput2","v":0},"gm/hp-hr"]
["CHP NOx input lb/MMBtu",{"$f":"chpnoxinput3","v":0},"lb/MMBtu"]
["CHP NOx input lb/MWh",{"$f":"chpnoxinput4","v":0},"lb/MWh"]
["CHP NOxconv",{"$f":"IF(chpfuelinput=1,ppmbtu,ppmbtud)","v":258}]
["CHP NOxrate Btu",{"$f":"IF(B70>0,B70/B74,IF(B71>0,B71*B66*0.866,IF(B72>0,B72,B73*1000/B65)))","v":{"$error":"#DIV/0!"}},"lb/MMBtu"]
["CHP NOxrate",{"$f":"B75*B65/1000","v":{"$error":"#DIV/0!"}},"lb/MWh"]
[]
["CHP NOx",{"$f":"IF(chr=FALSE,0,cMWh*cnoxrate/2000)","v":0},"tons/year"]
[]
["CHP sulfur % ",{"$f":"chpsulfurinput1","v":0}]
["CHP sulfur input ppm",{"$f":"chpsulfurinput2","v":0},"ppm"]
["Calculated sulfur %",{"$f":"IF(B80>0,B80,B81/1000000)","v":0}]
["CHP Fuel heat content",{"$f":"IF(heatinput1>0,heatinput1,IF(heatinput2>0,heatinput2,IF(heatinput3>0,heatinput3,0)))","v":0},{"$f":"IF(heatinput1>0,\"Btu/cf\",IF(heatinput2>0,\"Btu/gallon\",IF(heatinput3>0,\"Btu/lb\",0)))","v":0}]
["Adj CHP Fuel Heat content",{"$f":"IF(heatinput1>0,heatinput1/ngdensity,IF(heatinput2>0,IF(chpfuelinput =5,heatinput2/propDensity,heatinput2/distdensity),IF(heatinput3>0,heatinput3,0)))","v":0},"Btu/lb"]
["CHP massfuel ",{"$f":"IF(B84>0,B68*1000000/(B84*2000),0)","v":0},"tons/year"]
["CHP SO2 ",{"$f":"IF(B81>0,cMWh*cso2rate/2000,B82*B85*2)","v":0},"tons/year"]
["CHP SO2 rate",{"$f":"IF(B81>0,B81/B74*B65/1000,cso2tons*2000/cMWh)","v":{"$error":"#DIV/0!"}},"lb/MWh","CHP CH4",{"$f":"cbtu*STMTech!H23/2000","v":{"$error":"#N/A"}},"tons/year"]
[null,null,null,"CHP N2O",{"$f":"cbtu*STMTech!I23/2000","v":{"$error":"#N/A"}},"tons/year"]
["CHP CO2",{"$f":"cbtu*co2input/2000","v":0},"tons/year"]
["CHP CO2 Rate",{"$f":"cco2tons*2000/cMWh","v":{"$error":"#DIV/0!"}},"lb/MWh"]
[]
[]
["Steam Turbine"]
["Steam Consumption lb Steam/hr",{"$f":"lbsteamperhr","v":0}]
["Steam Consumption MMBtu Steam/hr",{"$f":"mmbtusteamperhr","v":0}]
["Calc Steam Cons MMBtu/hr",{"$f":"IF(B95>0,B95,IF(B94>0,B94*lbtobtusteam/1000000,))","v":0}]
[]
["Boiler Efficiency",{"$f":"boilereff","v":0}]
[]
["B/ST Fuel Consumption MMBtu/yr",{"$f":"IFERROR(IF(chptechinput=6,((B96*chours)+(B60/0.95))/B98,0),\"-\")","v":0}]
["B/ST Steam Displaced MMBtu/yr",{"$f":"B96*chours","v":0}]
[]
[]
["Duct Burners"]
["Capacity of Duct Burners",{"$f":"chpduct2","v":0},"MMBtu/hr"]
["Duct Burner Hours",{"$f":"IF(chpduct1=1,IF(ducthours1>0,ducthours1,ductpercent*chours),0)","v":0},"hours/year"]
["Duct Burner Btu",{"$f":"B105*0.88*ducthours","v":0},"MMBtu/year"]
[]
["Duct Burner NOx rate",{"$f":"IF(chpduct3>0,chpduct3,IF(chpfuelinput=1,chpduct4/ppmbtu,chpduct4/ppmbtud))","v":0},"lb/MMBtu"]
["Duct Burner SO2 rate",{"$f":"IF(chpduct1=2,0,cso2rate*1000/chr)","v":{"$error":"#DIV/0!"}},"lb/MMBtu","Duct Burner CH4 rate",{"$f":"IF(chpduct1=2,0,ch4gas)","v":2.2040000000000002E-3},"lb/MMBtu"]
["Duct Burner CO2 rate",{"$f":"IF(chpduct1=2,0,cco2rate*1000/chr)","v":{"$error":"#DIV/0!"}},"lb/MMBtu","Duct Burner N2O rate",{"$f":"IF(chpduct1=2,0,n2ogas)","v":2.2040000000000002E-4},"lb/MMBtu"]
["Duct Burner NOx",{"$f":"B109*B107/2000","v":0},"tons/year","Duct Burner CH4  ",{"$f":"E110*B107/2000","v":0},"tons/year"]
["Duct Burner SO2",{"$f":"B110*B107/2000","v":{"$error":"#DIV/0!"}},"tons/year","Duct Burner N2O  ",{"$f":"E111*B107/2000","v":0},"tons/year"]
["Duct Burner CO2",{"$f":"B111*B107/2000","v":{"$error":"#DIV/0!"}},"tons/year"]
[]
[]
["Cooling"]
["Chiller",{"$f":"coolinput3","v":0},{"$f":"LOOKUP(B118,lista9a,lista9e)","v":{"$error":"#N/A"}}]
["Cooling Hours",{"$f":"IF(chpheatcoolboth=3,IF(coolhours>0,coolhours,coolpercent*chours),IF(chpheatcoolboth=2,IF(coolhours>0,coolhours,coolpercent*chours),0))","v":0},"Hours/year"]
["Available Thermal",{"$f":"IF(chpphinput>0,chpnumunits*(ccap*3.412/(chpphinput*1000)+B105),0)","v":0},"MMBtu/hr"]
["Available based on user data (not rounded)",{"$f":"(coolavailablemmbturaw*1000000/coolbtuton)","v":0},"tons of cooling"]
["Available based on user data",{"$f":"ROUNDDOWN(coolavailablemmbturaw*1000000/coolbtuton,1)","v":0},"tons of cooling"]
["Available based on user data (not rounded)",{"$f":"(B120*coolinput3a)","v":0},"MMBtu/hr of cooling"]
["Available based on user data",{"$f":"ROUNDDOWN(B120*coolinput3a,1)","v":0},"MMBtu/hr of cooling"]
[]
["CHP Cooling COP",{"$f":"coolinput3a","v":0},"COP"]
["Cooling",{"$f":"IF(coolinput2a>0,coolinput2a*12000/1000000,coolinput2b)","v":0},"MMBtu/hr"]
["Thermal Demand for cooling",{"$f":"IF(B126>0,B127/B126,0)","v":0},"MMBtu/hr"]
["Thermal Demand for cooling",{"$f":"B128*B119","v":0},"MMBtu/year"]
["Excess Thermal",{"$f":"B119*(B120-B128)","v":0},"MMBtu/year"]
["Lost Simultaneous Heating",{"$f":"IF(chpheatcoolsimultaneous=2,B130,0)","v":0},"MMBtu/year"]
["Off season heating",{"$f":"B120*(chours-B119)","v":0},"MMBtu/year"]
[]
["Displaced Cooling Technology",{"$f":"cooldisp1","v":0},{"$f":"LOOKUP(B134,listh3a,listh3)","v":{"$error":"#N/A"}}]
["Displaced Cooling COP",{"$f":"IF(cooldisp2>0,3.517/cooldisp2,cooldisp3)","v":0},"COP"]
["Displaced Cooling Elec Demand",{"$f":"IF(B135>0,B127/B135,0)","v":0},"MMBtu/hr"]
["Displaced Cooling Elec Demand",{"$f":"B136/3.412","v":0},"MWh/hr"]
["Displaced Cooling Elec Demand",{"$f":"B137*B119*thermutil","v":0},"MWh/year"]
[]
[]
[]
["Displaced Generation"]
["DE method input",{"$f":"deinput1","v":2},{"$f":"LOOKUP(B143,listb5a,listb5)","v":"eGRID Fossil Fuel (2012 data)"}]
["EGrid State",{"$f":"deinput2","v":1},{"$f":"LOOKUP(deinput2,listb6a,listb6)","v":"US Average"}]
["DE NOx rate",{"$f":"Profiles!C4","v":1.3268},"lb/MWh","DE CH4 rate",{"$f":"Profiles!G4","v":3.3887508382591906E-2},"lb/MWh"]
["DE SO2 rate",{"$f":"Profiles!C5","v":2.5741000000000001},"lb/MWh","DE N2O rate",{"$f":"Profiles!G5","v":2.2624581495462905E-2},"lb/MWh"]
["DE CO2 rate",{"$f":"Profiles!C6","v":1640.1344999999999},"lb/MWh"]
["DE Heat Rate",{"$f":"Profiles!C7","v":9447.7084265316407},"Btu/kWh"]
["Displaced Generation (CHP)",{"$f":"cMWh","v":0},"MWh/year per CHP unit"]
["Displaced Generation (Cooling)",{"$f":"B138/chpnumunits","v":0},"MWh/year per CHP unit"]
["Displaced Generation (heating)",{"$f":"B192","v":0},"MWh/year per CHP unit"]
["Transmission Losses",{"$f":"lossinput","v":8.3299999999999999E-2}]
["Transmission Losses",{"$f":"(B149+B150+B151)*B152","v":0},"MWh/year per CHP unit"]
["Total Displaced Generating - Calc",{"$f":"B149+B150+B151+B153","v":0},"MWh/year per CHP unit"]
["Total Displaced Generating - Manual",{"$f":"dispgridelec","v":0},"MWh/year (estimated by user)"]
["DE NOx",{"$f":"denoxrate*B154/2000","v":0},"tons/year per CHP unit","DE CH4  ",{"$f":"dech4rate*B154/2000","v":0},"tons/year per CHP unit"]
["DE SO2",{"$f":"deso2rate*B154/2000","v":0},"tons/year per CHP unit","DE N2O  ",{"$f":"den2orate*B154/2000","v":0},"tons/year per CHP unit"]
["DE CO2",{"$f":"deco2rate*B154/2000","v":0},"tons/year per CHP unit"]
["DE MMBtu",{"$f":"deheatrate*B154/1000","v":0},"MMBtu/year per CHP unit"]
[]
[]
["Displaced Thermal Supply"]
["Thermal Utilization %",{"$f":"thermutil","v":0}]
["Power to Heat ratio",{"$f":"IF(chpphinput=0,0,IF(chptechinput=9,0,IF(chpphinput>0,chpphinput,B60/B100)))","v":0}]
["Heat from CHP units",{"$f":"IF(chptechinput=6,B101/boilereff,IF(chpphinput=0,0,IF(chptechinput=9,0,chpnumunits*(cMWh*3.412/(B164)))))","v":0},"MMBtu/yr"]
["Heat from Duct Burners",{"$f":"chpnumunits*B107","v":0},"MMBtu/yr"]
["Heat from CHP units to cooling",{"$f":"B129","v":0},"MMBtu/yr"]
["Heat from CHP units \"lost\"",{"$f":"B131","v":0},"MMBtu/yr"]
["Heat from CHP units to thermal use",{"$f":"IF(chpheatcoolboth<>2,B165+B166-B167-B168,0)","v":0},"MMBtu/yr"]
["Heat from WHP to thermal use",{"$f":"IF(whptherminput>0,whptherminput*chours)","v":false},"MMBtu/yr",{"$f":"MAX(B169:B170)*B163","v":0}]
["Stm source input",{"$f":"stminput1","v":0},{"$f":"IF(stminput1>0,LOOKUP(stminput1,listd2a,listd2),\" \")","v":" "}]
["Stm sulfur input %",{"$f":"stmsulfurinput1","v":0}]
["Stm sulfur input ppm",{"$f":"stmsulfurinput2","v":0}]
["Calculated Stm sulfur %",{"$f":"IF(B172>0,B172,IF(B173>0,B173/1000000,IF(stminput1>0,STMTech!E4,0)))","v":0}]
["Stm Efficiency",{"$f":"stmeff","v":0}]
["Stm BoilFuel",{"$f":"IF(dispboilerfuel>0,dispboilerfuel,IF(D170>0,IF(B175>0,D170/B175,0),0))","v":0},"MMBtu/year"]
["Max Stm BoilFuel",{"$f":"(chpnumunits*(IF(B119>0,((chours-IF(chpheatcoolsimultaneous=1,MAX(coolinput2a/coolavailabletons,coolinput2b/coolavailableMMBtu),1)*B119)/chours),1)*cMWh*3.412/(B164)/B175))","v":{"$error":"#DIV/0!"}},"MMBtu/year"]
["STM Fuel heat content",{"$f":"IF(stmheatinput1>0,stmheatinput1,IF(stmheatinput2>0,stmheatinput2,IF(stmheatinput3>0,stmheatinput3,0)))","v":0},{"$f":"IF(stmheatinput1>0,\"Btu/cf\",IF(stmheatinput2>0,\"Btu/gallon\",IF(stmheatinput3>0,\"Btu/lb\",\" \")))","v":" "}]
["Adj STM Fuel Heat content",{"$f":"IF(stmheatinput1>0,stmheatinput1/ngdensity,IF(stmheatinput2>0,stmheatinput2/distdensity,IF(stmheatinput3>0,stmheatinput3,0)))","v":0},"Btu/lb"]
["Stm boil fuel mass",{"$f":"IF(B179>0,dsbtu*1000000/(B179*2000),0)","v":0},"tons/year"]
["Stm SO2 ",{"$f":"B174*B180*2","v":0},"tons/year"]
["Stm NOx rate",{"$f":"IF(stmnoxinput>0,stmnoxinput,IF(stminput1<>0,STMTech!D4,0))","v":0},"lb/MMBtu","Stm CH4 rate",{"$f":"IF(stminput1<>0,STMTech!J4,0)","v":0},"lb/MMBtu"]
["Stm NOx",{"$f":"B182*dsbtu/2000","v":0},"tons/year","Stm CH4 ",{"$f":"E182*dsbtu/2000","v":0},"tons/year"]
["Stm CO2 rate",{"$f":"IF(stmco2input>0,stmco2input,IF(stminput1<>0,STMTech!G4,0))","v":0},"lb/MMBtu","Stm N2O rate",{"$f":"IF(stminput1<>0,STMTech!K4,0)","v":0},"lb/MMBtu"]
["Stm Co2",{"$f":"B184*dsbtu/2000","v":0},"tons/year","Stm N2O",{"$f":"E184*dsbtu/2000","v":0},"tons/year"]
[]
["Displaced Heating Electricity"]
["Heat from CHP units to thermal use",{"$f":"IF(stminput1=9,D170,0)","v":0},"MMBtu/year"]
["Electric Efficiency of Heating Unit",{"$f":"stmeff","v":0}]
[null,{"$f":"IF(B188>0,B188/B189/chours,0)","v":0},"MMBtu/hr"]
["Displaced Heating Elec Demand",{"$f":"B190/3.412","v":0},"MWh/hr"]
["Displaced Heating Elec Demand",{"$f":"B191*chours","v":0},"MWh/year"]