Year,TRI Facility ID,Facility Name,Street Address,City,County,ST,ZIP,Latitude,Longitude,Primary NAICS,NAICS 2,NAICS 3,NAICS 4,NAICS 5,NAICS 6,Parent Company Name,Parent Company DB Number,Doc_Ctrl_Num,Chemical,CAS #/Compound ID,Unit of Measure,Waste Management Code,Waste Management Description,Category of Waste Management,Sequence No.,Off-site Amount Sequence,Release NA,Dioxin Congener 1,Dioxin Congener 2,Dioxin Congener 3,Dioxin Congener 4,Dioxin Congener 5,Dioxin Congener 6,Dioxin Congener 7,Dioxin Congener 8,Dioxin Congener 9,Dioxin Congener 10,Dioxin Congener 11,Dioxin Congener 12,Dioxin Congener 13,Dioxin Congener 14,Dioxin Congener 15,Dioxin Congener 16,Dioxin Congener 17,Calculated TEQ,Total Transfer,Off Site Name,Off Site Address,Off Site City,Off Site County,Off Site State,Off Site Province,Off Site ZIP,Off Site Countru Abbr,Off Site Country,RCRA Num,Controlled Location,Data Extracted On
2009,00656DCRBNBOMAG,PREPA - SOUTH COAST POWER PLAN T,PR-127 KM157,GUAYANILLA,GUAYANILLA,PR,006560580,18.003611,-66.754444,221112,221122,221121,,,,PUERTO RICO ELECTRIC POWER AUTHORITY,090034703,1309207651896,DIOXIN AND DIOXIN-LIKE COMPOUNDS,N150,Grams,M73,Land Treatment,Release/Disposal,0,1,No,0,0,0,0,0,0,0,0,0,0,0,0,0,0,0,0,0,0,0,BROWNING FERRIS INDUSTRIES BFI OF PONCE INC. IND. WASTE DIV.,P.O. BOX 7104,PONCE,PONCE,PR,"",00732,USA,United States,SR-58-0132,No,09/28/2010
2009,00751PRPGRPRO3K,PREPA - AGUIRRE POWER GENERATI ON COMPLEX,PR-03 KM 1527 BO MONTESORRIA AGUIRRE,AGUIRRE,SALINAS,PR,007040137,17.946075,-66.233802,221112,221122,221121,,,,PUERTO RICO ELECTRIC POWER AUTHORITY,090034703,1309207537832,DIOXIN AND DIOXIN-LIKE COMPOUNDS,N150,Grams,M73,Land Treatment,Release/Disposal,0,1,No,0,0,0,0,0,0,0,0,0,0,0,0,0,0,0,0,0,0,.0048,BFI BROWNING FERRIS IND. OF PONCE INC. IND. WASTE DIV.,P.O. BOX 7104 PONCE,PONCE,PONCE,PR,"",00732,USA,United States,SR-58-0132,No,09/28/2010
2009,00920PRPSNMERCA,PREPA - SAN JUAN STEAM PLANT,MERCADO CENTRAL AVE ZONA PORTUARIA RD PR-28,PUERTO NUEVO,SAN JUAN,PR,00920,18.429167,-66.105,221112,221122,221121,,,,PUERTO RICO ELECTRIC POWER AUTHORITY,090034703,1309207955535,DIOXIN AND DIOXIN-LIKE COMPOUNDS,N150,Grams,M73,Land Treatment,Release/Disposal,0,1,No,0,0,0,0,0,0,0,0,0,0,0,0,0,0,0,0,0,0,.0785,BROWNING FERRIS INDUSTRIES BFI OF PONCE INC. IND. WASTE DIV.,P.O. BOX 7104 PONCE,PONCE,PONCE,PR,"",00732,USA,United States,SR-58-0132,No,09/28/2010
2009,00950PRPPLPR165,PREPA - PALO SECO STEAM PLANT,PR-165 KM 318,TOA BAJA,TOA BAJA,PR,00949,18.457778,-66.148889,221112,221122,221121,,,,PUERTO RICO ELECTRIC POWER AUTHORITY,090034703,1309207537768,DIOXIN AND DIOXIN-LIKE COMPOUNDS,N150,Grams,M73,Land Treatment,Release/Disposal,0,1,No,0,0,0,0,0,0,0,0,0,0,0,0,0,0,0,0,0,0,0,BROWNING FERRIS INDUSTRIES BFI OF PONCE INC. IND. WASTE DIV.,P.O. BOX 7104 PONCE,PONCE,PONCE,PR,"",00732,USA,United States,SR-58-0132,No,09/28/2010
2009,03304PBLCS97RIV,MERRIMACK STATION,97 RIVER RD,BOW,MERRIMACK,NH,03304,43.140833,-71.467778,221112,,,,,,PUBLIC SERVICE CO OF NEW HAMPSHIRE,103801387,1309207744475,DIOXIN AND DIOXIN-LIKE COMPOUNDS,N150,Grams,M64,Other Landfills,Release/Disposal,0,1,No,0,0,0,0,0,0,0,0,0,0,0,0,0,0,0,0,0,0,0,TURNKEY LANDFILL,97 ROCHESTER ROAD,GONIC,STRAFFORD,NH,"",03839,USA,United States,NHD980914634,No,09/28/2010
2009,03304PBLCS97RIV,MERRIMACK STATION,97 RIVER RD,BOW,MERRIMACK,NH,03304,43.140833,-71.467778,221112,,,,,,PUBLIC SERVICE CO OF NEW HAMPSHIRE,103801387,1309207744475,DIOXIN AND DIOXIN-LIKE COMPOUNDS,N150,Grams,M64,Other Landfills,Release/Disposal,1,1,No,0,0,0,0,0,0,0,0,0,0,0,0,0,0,0,0,0,0,0,GREENWOOD STREET LANDFILL,30 NIPP NAPP TRAIL,WORCESTER,WORCESTER,MA,"",01607,USA,United States,NA,No,09/28/2010
2009,03801NWNGT165GO,PUBLIC SERVICE CO OF NEW HAMPSHIRE NEWINGTON STATION,165 GOSLING RD,NEWINGTON,ROCKINGHAM,NH,03801,43.105,-70.806944,221112,,,,,,PUBLIC SERVICE CO OF NEW HAMPSHIRE,781260336,1309207776927,DIOXIN AND DIOXIN-LIKE COMPOUNDS,N150,Grams,M64,Other Landfills,Release/Disposal,0,1,No,0,0,0,0,0,0,0,0,0,0,0,0,0,0,0,0,0,0,0,WASTE MANAGEMENT NH TURNKEY LA,90 ROCHESTER NECK ROAD,ROCHESTER,STRAFFORD,NH,"",03867,USA,United States,NHD980914634,No,09/28/2010
2009,03801PBLCSGOSLI,SCHILLER STATION,400 GOSLING RD,PORTSMOUTH,ROCKINGHAM,NH,03801,43.097778,-70.784167,221112,,,,,,PUBLIC SERVICE CO OF NEW HAMPSHIRE,781260336,1309207799786,DIOXIN AND DIOXIN-LIKE COMPOUNDS,N150,Grams,M64,Other Landfills,Release/Disposal,0,1,No,0,0,0,0,0,0,0,0,0,0,0,0,0,0,0,0,0,0,0,TURNKEY LANDFILL,97 ROCHESTER ROAD,GONIC,STRAFFORD,NH,"",03839,USA,United States,NHD980914634,No,09/28/2010
2009,03801PBLCSGOSLI,SCHILLER STATION,400 GOSLING RD,PORTSMOUTH,ROCKINGHAM,NH,03801,43.097778,-70.784167,221112,,,,,,PUBLIC SERVICE CO OF NEW HAMPSHIRE,781260336,1309207799786,DIOXIN AND DIOXIN-LIKE COMPOUNDS,N150,Grams,M64,Other Landfills,Release/Disposal,1,1,No,0,0,0,0,0,0,0,0,0,0,0,0,0,0,0,0,0,0,0,GREENWOOD STREET LANDFILL,30 NIPP NAPP TRAIL,WORCESTER,WORCESTER,MA,"",01607,USA,United States,NA,No,09/28/2010
2009,03801PBLCSGOSLI,SCHILLER STATION,400 GOSLING RD,PORTSMOUTH,ROCKINGHAM,NH,03801,43.097778,-70.784167,221112,,,,,,PUBLIC SERVICE CO OF NEW HAMPSHIRE,781260336,1309207799786,DIOXIN AND DIOXIN-LIKE COMPOUNDS,N150,Grams,M79,Other Land Disposal,Release/Disposal,2,1,No,0,0,0,0,0,0,0,0,0,0,0,0,0,0,0,0,0,0,0,"SOIL PREPARATION, INC.",135 VALLEY ROAD,PLYMOUTH,PENOBSCOT,ME,"",04969,USA,United States,NA,No,09/28/2010
2009,03801PBLCSGOSLI,SCHILLER STATION,400 GOSLING RD,PORTSMOUTH,ROCKINGHAM,NH,03801,43.097778,-70.784167,221112,,,,,,PUBLIC SERVICE CO OF NEW HAMPSHIRE,781260336,1309207799786,DIOXIN AND DIOXIN-LIKE COMPOUNDS,N150,Grams,M64,Other Landfills,Release/Disposal,3,1,No,0,0,0,0,0,0,0,0,0,0,0,0,0,0,0,0,0,0,0,PINE TREE LANDFILL,358 EMERSON MILL ROAD,HAMPDEN,PENOBSCOT,ME,"",04444,USA,United States,MER000503946,No,09/28/2010
2009,04276BSCSCROUTE,RUMFORD PAPER CO,35 HARTFORD ST,RUMFORD,OXFORD,ME,04276,44.550556,-70.536389,322121,322110,,,,,NEWPAGE CORP,197533446,1309207694872,DIOXIN AND DIOXIN-LIKE COMPOUNDS,N150,Grams,M64,Other Landfills,Release/Disposal,0,1,No,0,0,0,0,0,.0064,.0657,.053,.0043,.004,0,0,.0027,0,.0026,.0004,.0027,.0070135,.1419,FARRINGTON MOUNTAIN LANDFILL,RT 2,MEXICO,OXFORD,ME,"",04257,USA,United States,S000686WDQR,Yes,09/28/2010
2009,04430GRTNRMAINS,KATAHDIN PAPER CO LLC,50 MAIN ST,EAST MILLINOCKET,PENOBSCOT,ME,04430,45.620278,-68.569722,322121,,,,,,KATAHDIN PAPER CO LLC,NA,1309207995376,DIOXIN AND DIOXIN-LIKE COMPOUNDS,N150,Grams,M64,Other Landfills,Release/Disposal,0,1,No,.004004,.007639,.007088,.009394,.005964,.086526,.050182,.093803,.014704,.014625,.005168,.003629,.001549,.001237,.001887,.000584,.001918,.0301604,.31,DOLBY LANDFILL,ROUTE 157,EAST MILLINOCKET,PENOBSCOT,ME,"",04430,USA,United States,NA,Yes,09/28/2010
2009,04457LNCLNKATAH,LINCOLN PAPER & TISSUE LLC,50 KATAHDIN AVE,LINCOLN,PENOBSCOT,ME,04457,45.37,-68.509167,322110,322121,,,,,NA,NA,1309208005088,DIOXIN AND DIOXIN-LIKE COMPOUNDS,N150,Grams,M90,Other Off-Site Management,Release/Disposal,0,1,No,.0079,.0048,0,0,0,.0123,.0108,.0915,.0224,.0286,0,0,0,0,0,0,0,.0312282,.1783,"SOIL PREPARATION, INC.",P.O. BOX 158,PLYMOUTH,PENOBSCOT,ME,"",04969,USA,United States,NA,No,09/28/2010
2009,04457LNCLNKATAH,LINCOLN PAPER & TISSUE LLC,50 KATAHDIN AVE,LINCOLN,PENOBSCOT,ME,04457,45.37,-68.509167,322110,322121,,,,,NA,NA,1309208005088,DIOXIN AND DIOXIN-LIKE COMPOUNDS,N150,Grams,M90,Other Off-Site Management,Release/Disposal,1,1,No,.0154,.0095,0,0,0,.0241,.0211,.1786,.0438,.0559,0,0,0,0,0,0,0,.0610913,.3484,JUNIPER RIDGE LANDFILL,ROUTE 16 2828 BENNOCH ROAD,OLD TOWN,PENOBSCOT,ME,"",04468,USA,United States,NA,No,09/28/2010
2009,04468JMSRVPORTL,RED SHIELD ACQUISITION LLC,24 PORTLAND ST,OLD TOWN,PENOBSCOT,ME,04468,44.917222,-68.636111,322110,,,,,,PATRIARCH PARTNERS LLC,NA,1309207940798,DIOXIN AND DIOXIN-LIKE COMPOUNDS,N150,Grams,M64,Other Landfills,Release/Disposal,1,1,No,0,0,0,0,0,0,0,0,0,0,0,0,0,0,0,0,0,0,.329,JUNIPER RIDGE LANDFILL,2828 BENNOCH RD,OLD TOWN,PENOBSCOT,ME,"",04468,USA,United States,NA,No,09/28/2010
2009,04740JMHBRPOBOX,HUBER ENGINEERED WOODS LLC,333 STATION RD,EASTON,AROOSTOOK,ME,04740,46.6508,-67.912632,321219,,,,,,JM HUBER CORP,002554459,1309207456688,DIOXIN AND DIOXIN-LIKE COMPOUNDS,N150,Grams,M64,Other Landfills,Release/Disposal,0,1,No,0,0,0,0,0,0,0,0,0,0,0,0,0,0,0,0,0,0,.001788,PRESQUE ISLE LANDFILL,202 LATHROP ROAD,PRESQUE ISLE,AROOSTOOK,ME,"",04769,USA,United States,NA,No,09/28/2010
2009,06096THDXTTWOEL,AHLSTROM NONWOVENS LLC,CANAL BANK RD,WINDSOR LOCKS,HARTFORD,CT,06096,41.925,-72.628,322121,313230,,,,,AHLSTROM,540163599,1309207550575,DIOXIN AND DIOXIN-LIKE COMPOUNDS,N150,Grams,M73,Land Treatment,Release/Disposal,0,1,No,0,0,0,0,0,0,0,0,0,.0064,0,.081,0,0,0,0,0,.01002,.0874,COVER TECHNOLOGIES INC,95 STATE STREET,SPRINGFIELD,HAMPDEN,MA,"",01103,USA,United States,NA,No,09/28/2010
2009,06506NWHVN1WATE,PSEG NEW HAVEN HARBOR STATION,1 WATERFRONT ST,NEW HAVEN,NEW HAVEN,CT,06512,41.283889,-72.905,221112,,,,,,PUBLIC SERVICE ENTERPRISE GROUP,848793910,1309207641301,DIOXIN AND DIOXIN-LIKE COMPOUNDS,N150,Grams,M92,Transfer to Waste Broker-Energy Recovery,Energy Recovery,0,1,No,0,0,0,0,0,.0000001,.0000006,0,0,0,0,0,0,0,.0000001,0,0,0,.0000008,BRIDGEPORT UNITED RECYCLING,50 CROSS STREET,BRIDGEPORT,FAIRFIELD,CT,"",06610,USA,United States,CTD002593887,No,09/28/2010
2009,07036XXN  1400P,CONOCOPHILLIPS CO - BAYWAY REFINERY,1400 PARK AVE,LINDEN,UNION,NJ,07036,40.640111,-74.218861,324110,,,,,,CONOCOPHILLIPS,118819478,1309207411493,DIOXIN AND DIOXIN-LIKE COMPOUNDS,N150,Grams,M64,Other Landfills,Release/Disposal,0,1,No,.00124,.00268,.00248,.00607,.00529,.08076,1.19628,.01243,.0062,.00968,.01515,.00784,.00667,.00084,.02088,.00214,.02376,.0140908,1.40039,CLEAN HARBORS CANADA INC,"4090 TELFER ROAD, RR#1",CORUNNA,"",,ONTARIO,N0N 1,CAN,Canada,NA,No,09/28/2010
2009,07036XXN  1400P,CONOCOPHILLIPS CO - BAYWAY REFINERY,1400 PARK AVE,LINDEN,UNION,NJ,07036,40.640111,-74.218861,324110,,,,,,CONOCOPHILLIPS,118819478,1309207411493,DIOXIN AND DIOXIN-LIKE COMPOUNDS,N150,Grams,M64,Other Landfills,Release/Disposal,1,1,No,.00001,.00002,.00002,.00002,.00002,.0005,.00674,.00008,.00006,.00008,.00011,.00006,.00006,.00002,.00019,.00002,.0002,.000104,.00821,EI DUPONT DENEMOURS & CO,ROUTE 130 AND CANAL ROAD,DEEPWATER,SALEM,NJ,"",08023,USA,United States,NJD002385730,No,09/28/2010
2009,07036XXN  1400P,CONOCOPHILLIPS CO - BAYWAY REFINERY,1400 PARK AVE,LINDEN,UNION,NJ,07036,40.640111,-74.218861,324110,,,,,,CONOCOPHILLIPS,118819478,1309207411493,DIOXIN AND DIOXIN-LIKE COMPOUNDS,N150,Grams,M64,Other Landfills,Release/Disposal,2,1,No,.00471,.00841,.00841,.00841,.00841,.2486,3.36067,.04171,.02759,.04037,.05248,.0296,.03028,.00841,.09352,.00841,.09958,.0493731,4.07957,VEOLIA ENVIRONMENTAL SERVICES,635 TOBY ROAD,KERSEY,ELK,PA,"",15846,USA,United States,PAD987398831,No,09/28/2010
2009,07407MRCLP1MARK,MARCAL  MANUFACTURING LLC,1 MARKET ST,ELMWOOD PARK,BERGEN,NJ,074071451,40.902127,-74.130183,322291,,,,,,MARCAL MANUFACTURING LLC,827074753,1309207209368,DIOXIN AND DIOXIN-LIKE COMPOUNDS,N150,Grams,M26,Other Reuse or Recovery,Recycling,1,1,No,.002,.017,.017,.028,.017,1.773,17.162,.088,.017,.017,.017,.017,.017,.017,.071,.017,.25,.0702436,19.54,SUMMIT ANTHRACITE,512 MAIN STREET,GOOD SPRING,SCHUYLKILL,PA,"",17981,USA,United States,NA,No,09/28/2010
2009,07407MRCLP1MARK,MARCAL  MANUFACTURING LLC,1 MARKET ST,ELMWOOD PARK,BERGEN,NJ,074071451,40.902127,-74.130183,322291,,,,,,MARCAL MANUFACTURING LLC,827074753,1309207209368,DIOXIN AND DIOXIN-LIKE COMPOUNDS,N150,Grams,M56,Energy Recovery,Energy Recovery,2,1,No,.003,.028,.028,.047,.028,2.981,28.859,.148,.028,.028,.028,.028,.028,.028,.119,.028,.42,.1166037,32.86,NORTHAMPTON GENERATING COMPANY,1 HORWITH DRIVE,NORTHAMPTON,NORTHAMPTON,PA,"",18067,USA,United States,NA,No,09/28/2010
2009,07407MRCLP1MARK,MARCAL  MANUFACTURING LLC,1 MARKET ST,ELMWOOD PARK,BERGEN,NJ,074071451,40.902127,-74.130183,322291,,,,,,MARCAL MANUFACTURING LLC,827074753,1309207209368,DIOXIN AND DIOXIN-LIKE COMPOUNDS,N150,Grams,M26,Other Reuse or Recovery,Recycling,3,1,No,.003,.028,.028,.047,.028,2.954,28.602,.147,.028,.028,.028,.028,.028,.028,.118,.028,.417,.1161457,32.57,THE SCOTTS COMPANY,311 REEDVILLE ROAD,OXFORD,CHESTER,PA,"",19363,USA,United States,NA,No,09/28/2010
2009,07407MRCLP1MARK,MARCAL  MANUFACTURING LLC,1 MARKET ST,ELMWOOD PARK,BERGEN,NJ,074071451,40.902127,-74.130183,322291,,,,,,MARCAL MANUFACTURING LLC,827074753,1309207209368,DIOXIN AND DIOXIN-LIKE COMPOUNDS,N150,Grams,M26,Other Reuse or Recovery,Recycling,4,1,No,.001,.007,.007,.013,.007,.786,7.611,.039,.007,.007,.007,.007,.007,.007,.031,.007,.111,.0302666,8.66,NJMC,1 DEKORTE PARK PLAZA,LYNDHURST,BERGEN,NJ,"",07071,USA,United States,NA,No,09/28/2010
2009,08103STTMT941SO,STATE METAL INDUSTRIES INC,941 S SECOND ST,CAMDEN,CAMDEN,NJ,08103,39.933374,-75.12759,331314,,,,,,NA,NA,1309207981895,DIOXIN AND DIOXIN-LIKE COMPOUNDS,N150,Grams,M66,RCRA Subtitle C Surface Impoundment,Release/Disposal,0,1,No,.1342,.1261,.0427,.0732,.1078,.2237,.3458,11.187,.7526,.8746,1.0577,.4271,.0264,.2441,.8136,.12,.3254,1.8736324,16.882,"WASTE MANAGEMENT OF PA GROWS, INC.",1513 BORDENTOWN ROAD,MORRISVILLE,BUCKS,PA,"",19067,USA,United States,PAD982704264,No,09/28/2010
2009,12188GNRLL260HU,MPM SILICONES LLC,260 HUDSON RIVER RD,WATERFORD,SARATOGA,NY,12188,42.814251,-73.677185,325211,325188,325212,,,,MOMENTIVE PERFORMANCE MATERIALS USA INC,NA,1309207884747,DIOXIN AND DIOXIN-LIKE COMPOUNDS,N150,Grams,M50,Incineration/Thermal Treatment,Treatment,0,1,No,.002695,.003657,.004716,.007523,.006031,.066406,.33203,.012319,.011966,.012207,.051328,.019569,.002807,.017323,.130566,.027589,.309574,.0249728,1,LAFARGE CEMENT,P.O. BOX 390,ST. CONSTANT,"",,QUEBEC,J5A2G,CAN,Canada,NA,No,09/28/2010
2009,12188GNRLL260HU,MPM SILICONES LLC,260 HUDSON RIVER RD,WATERFORD,SARATOGA,NY,12188,42.814251,-73.677185,325211,325188,325212,,,,MOMENTIVE PERFORMANCE MATERIALS USA INC,NA,1309207884747,DIOXIN AND DIOXIN-LIKE COMPOUNDS,N150,Grams,M65,RCRA Subtitle C Landfills,Release/Disposal,1,1,No,.000423,.000574,.000741,.001181,.000947,.010429,.052144,.001935,.001879,.001917,.008061,.003073,.000441,.002721,.020505,.004333,.048617,.0039214,.16,CHEMICAL WASTE MANAGEMENT,1550 BALMER ROAD,MODEL CITY,NIAGARA,NY,"",14107,USA,United States,NYD049836679,No,09/28/2010
2009,12188GNRLL260HU,MPM SILICONES LLC,260 HUDSON RIVER RD,WATERFORD,SARATOGA,NY,12188,42.814251,-73.677185,325211,325188,325212,,,,MOMENTIVE PERFORMANCE MATERIALS USA INC,NA,1309207884747,DIOXIN AND DIOXIN-LIKE COMPOUNDS,N150,Grams,M50,Incineration/Thermal Treatment,Treatment,2,1,No,.000087,.000119,.000153,.000244,.000196,.002156,.010779,.0004,.000388,.000396,.001666,.000635,.000091,.000562,.004239,.000896,.01005,.0008103,.033,NORANDA COPPER SMELTING AND REFINING - HORNE DIVISION,101 PORTELANCE STREET,ROUYN - NORANDA,"",,QUEBEC,J9XB5,CAN,Canada,NA,No,09/28/2010
2009,12188GNRLL260HU,MPM SILICONES LLC,260 HUDSON RIVER RD,WATERFORD,SARATOGA,NY,12188,42.814251,-73.677185,325211,325188,325212,,,,MOMENTIVE PERFORMANCE MATERIALS USA INC,NA,1309207884747,DIOXIN AND DIOXIN-LIKE COMPOUNDS,N150,Grams,M50,Incineration/Thermal Treatment,Treatment,3,1,No,.004328,.005874,.007574,.012082,.009686,.10665,.533252,.019784,.019218,.019604,.082435,.031428,.004508,.027822,.209694,.044309,.497187,.0401073,1.6,ST. MARY'S CEMENT CO.,585 WATER STREET SOUTH,ST. MARY'S,"",,ONTARIO,N4X 1B6,CAN,Canada,NA,No,09/28/2010
2009,12188GNRLL260HU,MPM SILICONES LLC,260 HUDSON RIVER RD,WATERFORD,SARATOGA,NY,12188,42.814251,-73.677185,325211,325188,325212,,,,MOMENTIVE PERFORMANCE MATERIALS USA INC,NA,1309207884747,DIOXIN AND DIOXIN-LIKE COMPOUNDS,N150,Grams,M64,Other Landfills,Release/Disposal,4,1,No,.000145,.000197,.000254,.000405,.000325,.003573,.017866,.000663,.000644,.000657,.002762,.001053,.000151,.000932,.007026,.001485,.016658,.0013441,.055,STABLEX CANADA,760 INDUSTRIAL BLVD.,BLAINVILLE,"",,QUEBEC,J7C 3,CAN,Canada,NA,No,09/28/2010
2009,12801FNCHP1GLEN,FINCH PAPER  LLC,1 GLEN ST,GLENS FALLS,WARREN,NY,12801,43.306944,-73.641389,322121,322110,,,,,FINCH PAPER HOLDINGS,NA,1309207600038,DIOXIN AND DIOXIN-LIKE COMPOUNDS,N150,Grams,M64,Other Landfills,Release/Disposal,0,1,No,.0109,0,0,0,0,.115,1.0303,.0914,0,0,0,0,0,0,0,0,.0479,.0215135,1.2955,"SCOTT PAPER/FINCH PRUYN, PAPER SLUDGE MANAGEMENT FACILITY",PETERS RD,GANESVOORT,SARATOGA,NY,"",12831,USA,United States,NA,Yes,09/28/2010
2009,13126LCNRLLAKER,NOVELIS CORP,448 COUNTY RT 1A,OSWEGO,OSWEGO,NY,13126,43.493834,-76.456712,331315,331314,,,,,NOVELIS CORP,001504935,1309207516889,DIOXIN AND DIOXIN-LIKE COMPOUNDS,N150,Grams,M64,Other Landfills,Release/Disposal,0,1,No,.0000381,.0000896,.0000732,.000115,.0000822,.000484,.000584,.000717,.000514,.000899,.000537,.000631,.000327,.000768,.00111,.00023,.000409,.0007564,.0076081,BRISTOL HILL LANDFILL OSWEGO CO. DIV. OF SOLID WASTE,SILK ROAD,VOLNEY,OSWEGO,NY,"",13069,USA,United States,NYN00038514,No,09/28/2010
2009,13148SCPTR11LAM,SCEPTER INC,11 LAMB RD,SENECA FALLS,SENECA,NY,13148,42.920755,-76.785954,331314,,,,,,SCEPTER INC,NA,1309207749274,DIOXIN AND DIOXIN-LIKE COMPOUNDS,N150,Grams,M65,RCRA Subtitle C Landfills,Release/Disposal,0,1,No,.000428,.001111,.00069,.001035,.000626,.002363,.001629,.009581,.006694,.01108,.005442,.005072,.001737,.005493,.007767,.001028,.002095,.0081441,.0639,ENVIRITE OF OHIO,2050 CENTRAL AVENUE SE,CANTON,STARK,OH,"",44707,USA,United States,OHD980568992,No,09/28/2010
2009,13148SCPTR11LAM,SCEPTER INC,11 LAMB RD,SENECA FALLS,SENECA,NY,13148,42.920755,-76.785954,331314,,,,,,SCEPTER INC,NA,1309207749274,DIOXIN AND DIOXIN-LIKE COMPOUNDS,N150,Grams,M64,Other Landfills,Release/Disposal,1,1,No,.00344,.00894,.00555,.00833,.00504,.01902,.0131,.07709,.05386,.08917,.04379,.04081,.01398,.0442,.06249,.00827,.01686,.0655326,.51394,SENECA MEADOWS LANDFILL,1786 SALCMAN ROAD,WATERLOO,SENECA,NY,"",13165,USA,United States,NA,No,09/28/2010
2009,13148SCPTR11LAM,SCEPTER INC,11 LAMB RD,SENECA FALLS,SENECA,NY,13148,42.920755,-76.785954,331314,,,,,,SCEPTER INC,NA,1309207749274,DIOXIN AND DIOXIN-LIKE COMPOUNDS,N150,Grams,M65,RCRA Subtitle C Landfills,Release/Disposal,2,1,No,.00198,.00513,.00319,.00478,.00289,.01091,.00752,.04425,.03091,.05118,.02513,.02342,.00802,.02537,.03587,.00475,.00968,.0376168,.295,AMERICAN ENVIRONMENTAL,1689 SHARCAL ROAD,CALVERT CITY,MARSHALL,KY,"",42029,USA,United States,KYD985073196,No,09/28/2010
2009,14302CCDNT4700B,OCCIDENTAL CHEMICAL CORP NIAGARA PLANT,4700 BUFFALO AVE,NIAGARA FALLS,NIAGARA,NY,14302,43.080567,-79.008163,325181,325199,,,,,OCCIDENTAL PETROLEUM CORP,006908354,1309207226046,DIOXIN AND DIOXIN-LIKE COMPOUNDS,N150,Grams,M50,Incineration/Thermal Treatment,Treatment,1,1,No,0,0,0,0,0,0,0,0,0,0,1.25,0,0,0,4.98,0,35.3,.18539,41.53,CLEAN HARBORS  (DEER PARK TX),2027 BATTLEGROUND ROAD,DEER PARK,HARRIS,TX,"",77536,USA,United States,TXD055141378,No,09/28/2010
2009,14302CCDNT4700B,OCCIDENTAL CHEMICAL CORP NIAGARA PLANT,4700 BUFFALO AVE,NIAGARA FALLS,NIAGARA,NY,14302,43.080567,-79.008163,325181,325199,,,,,OCCIDENTAL PETROLEUM CORP,006908354,1309207226046,DIOXIN AND DIOXIN-LIKE COMPOUNDS,N150,Grams,M50,Incineration/Thermal Treatment,Treatment,2,1,No,0,0,0,0,0,0,0,0,0,0,0,0,0,0,0,0,0,0,1.0078,SIEMENS WATER TECHNOLOGY SERVICES,118 PARK ROAD,DARLINGTON,BEAVER,PA,"",16115,USA,United States,PAD987270725,No,09/28/2010
2009,14302CCDNT4700B,OCCIDENTAL CHEMICAL CORP NIAGARA PLANT,4700 BUFFALO AVE,NIAGARA FALLS,NIAGARA,NY,14302,43.080567,-79.008163,325181,325199,,,,,OCCIDENTAL PETROLEUM CORP,006908354,1309207226046,DIOXIN AND DIOXIN-LIKE COMPOUNDS,N150,Grams,M64,Other Landfills,Release/Disposal,3,1,No,0,0,0,0,0,0,0,0,0,0,0,0,0,0,0,0,0,0,.3705,AILLED /NIAGARA RECYCLING,56TH & NIAGARA FALLS BLVD,NIAGARA FALLS,NIAGARA,NY,"",14304,USA,United States,NYD080340094,No,09/28/2010
2009,14302CCDNT4700B,OCCIDENTAL CHEMICAL CORP NIAGARA PLANT,4700 BUFFALO AVE,NIAGARA FALLS,NIAGARA,NY,14302,43.080567,-79.008163,325181,325199,,,,,OCCIDENTAL PETROLEUM CORP,006908354,1309207226046,DIOXIN AND DIOXIN-LIKE COMPOUNDS,N150,Grams,M50,Incineration/Thermal Treatment,Treatment,4,1,No,0,0,0,0,0,0,0,0,0,0,.26,0,0,0,1.06,0,7.5,.03885,8.82,CLEAN HARBORS ELDORADO,309 AMERICAN CIRCLE,EL DORADO,UNION,AR,"",71730,USA,United States,ARD069748192,No,09/28/2010
2009,14652STMNK1669L,EASTMAN KODAK CO EASTMAN BUSINESS PARK,1669 LAKE AVE,ROCHESTER,MONROE,NY,146523615,43.200083,-77.647389,325992,,,,,,EASTMAN KODAK CO,002206183,1309207480308,DIOXIN AND DIOXIN-LIKE COMPOUNDS,N150,Grams,M65,RCRA Subtitle C Landfills,Release/Disposal,0,1,No,0,0,0,0,0,0,.000032,0,0,0,0,0,0,0,0,0,0,0,.000032,CWM CHEMICAL SERVICES,1550 BALMER ROAD,MODEL CITY,NIAGARA,NY,"",14107,USA,United States,NYD049836679,No,09/28/2010
2009,14652STMNK1669L,EASTMAN KODAK CO EASTMAN BUSINESS PARK,1669 LAKE AVE,ROCHESTER,MONROE,NY,146523615,43.200083,-77.647389,325992,,,,,,EASTMAN KODAK CO,002206183,1309207480308,DIOXIN AND DIOXIN-LIKE COMPOUNDS,N150,Grams,M90,Other Off-Site Management,Release/Disposal,1,1,No,0,0,0,0,0,0,.191045,0,0,0,0,0,0,0,0,0,0,.0000573,.191045,"NORANDA MINERALS, INC. HORNE DIVISION",101 AVENUE PORTELANCE,ROUYN-NORANDA,"",,ONTARIO,J9X 5,CAN,Canada,CDD980592497,No,09/28/2010
2009,15845PNNTC100CE,DOMTAR - JOHNSONBURG MILL,100 CENTER ST,JOHNSONBURG,ELK,PA,15845,41.492222,-78.676667,322121,,,,,,DOMTAR PAPER CO LLC,789245110,1309207505025,DIOXIN AND DIOXIN-LIKE COMPOUNDS,N150,Grams,M73,Land Treatment,Release/Disposal,0,1,No,0,0,0,0,0,0,0,0,0,0,0,0,0,0,0,0,0,0,0,BERNERD,DEP SITE,BENEZETTE,ELK,PA,"",15821,USA,United States,NA,Yes,09/28/2010
2009,15845PNNTC100CE,DOMTAR - JOHNSONBURG MILL,100 CENTER ST,JOHNSONBURG,ELK,PA,15845,41.492222,-78.676667,322121,,,,,,DOMTAR PAPER CO LLC,789245110,1309207505025,DIOXIN AND DIOXIN-LIKE COMPOUNDS,N150,Grams,M73,Land Treatment,Release/Disposal,1,1,No,0,0,0,0,0,0,0,0,0,0,0,0,0,0,0,0,0,0,0,PHEASANTS FOREVER SITE,STATE GAME LANDS #44,BRANDY CAMP,ELK,PA,"",15822,USA,United States,NA,Yes,09/28/2010
2009,15845PNNTC100CE,DOMTAR - JOHNSONBURG MILL,100 CENTER ST,JOHNSONBURG,ELK,PA,15845,41.492222,-78.676667,322121,,,,,,DOMTAR PAPER CO LLC,789245110,1309207505025,DIOXIN AND DIOXIN-LIKE COMPOUNDS,N150,Grams,M73,Land Treatment,Release/Disposal,2,1,No,0,0,0,0,0,0,0,0,0,0,0,0,0,0,0,0,0,0,0,STATE GAME LANDS 311,P&N SITE,BENEZETTE,ELK,PA,"",15821,USA,United States,NA,Yes,09/28/2010
2009,15845PNNTC100CE,DOMTAR - JOHNSONBURG MILL,100 CENTER ST,JOHNSONBURG,ELK,PA,15845,41.492222,-78.676667,322121,,,,,,DOMTAR PAPER CO LLC,789245110,1309207505025,DIOXIN AND DIOXIN-LIKE COMPOUNDS,N150,Grams,M73,Land Treatment,Release/Disposal,3,1,No,0,0,0,0,0,0,0,0,0,0,0,0,0,0,0,0,0,0,0,OYSTER RUN SITE,OYSTER RUN,BROCKPORT,JEFFERSON,PA,"",15823,USA,United States,NA,Yes,09/28/2010
2009,15927CLVRP141IN,COLVER POWER PROJECT,141 INTERPOWER DR,COLVER,CAMBRIA,PA,15927,40.553782,-78.798194,221119,,,,,,INTER-POWER/AHL/CON PARTNERS LP,110665130,1309207428160,DIOXIN AND DIOXIN-LIKE COMPOUNDS,N150,Grams,M73,Land Treatment,Release/Disposal,0,1,No,0,0,0,0,0,0,0,0,0,0,0,0,0,0,0,0,0,0,0,COLVER REFUSE SITE OPERATIONS,254 INTERPOWER DRIVE,COLVER,CAMBRIA,PA,"",15927,USA,United States,NA,Yes,09/28/2010
2009,15927CLVRP141IN,COLVER POWER PROJECT,141 INTERPOWER DR,COLVER,CAMBRIA,PA,15927,40.553782,-78.798194,221119,,,,,,INTER-POWER/AHL/CON PARTNERS LP,110665130,1309207428160,DIOXIN AND DIOXIN-LIKE COMPOUNDS,N150,Grams,M73,Land Treatment,Release/Disposal,1,1,No,0,0,0,0,0,0,0,0,0,0,0,0,0,0,0,0,0,0,0,SONMAN REFUSE SITE OPERATIONS,DULANCEY DRIVE,PORTAGE,CAMBRIA,PA,"",15946,USA,United States,NA,Yes,09/28/2010
2009,16673PPLTN100PA,APPLETON PAPERS INC,100 PAPER MILL RD,ROARING SPRING,BLAIR,PA,16673,40.3375,-78.405833,322121,322110,,,,,APPLETON PAPERS INC,089581557,1309207307873,DIOXIN AND DIOXIN-LIKE COMPOUNDS,N150,Grams,M64,Other Landfills,Release/Disposal,0,1,No,0,0,0,0,0,0,0,0,0,0,0,0,0,0,0,0,0,0,0,GREENTREE SUPERIOR LANDFILL,635 TOBY ROAD,KERSEY,ELK,PA,"",15846,USA,United States,PAD987398831,No,09/28/2010